program: Gaussian 09
title: 000077532
version: EM64L-G09RevD.01
frameworkgroup: C1[X(C12H7F15O2)]
method: RPBEPBE
basis: SDD
operation: Freq
keyword: #p
keyword: freq=noraman
keyword: PBEPBE/SDD
title: #p freq=noraman PBEPBE/SDD
converged: YES YES NO NO
title: Mulliken charges:
elementType: F F F F F F F F F F F F F F F O O C C C C C C C C C C C C H H H H H H H
charge: -0.119351 -0.134842 -0.126625 -0.123681 -0.124058 -0.135571 -0.118586 -0.115803 -0.147138 -0.145191 -0.120087 -0.122711 -0.120374 -0.126283 -0.123018 -0.263094 -0.234380 0.239215 0.244090 0.237756 0.256616 0.248834 0.209051 -0.312339 0.373733 0.170632 0.341251 -0.747760 -0.615238 0.272555 0.277861 0.246902 0.247023 0.218463 0.235881 0.256267
chargesum: 0.00000
title: Mulliken charges with hydrogens summed into heavy atoms:
elementType: F F F F F F F F F F F F F F F O O C C C C C C C C C C C C
charge: -0.119351 -0.134842 -0.126625 -0.123681 -0.124058 -0.135571 -0.118586 -0.115803 -0.147138 -0.145191 -0.120087 -0.122711 -0.120374 -0.126283 -0.123018 -0.263094 -0.234380 0.239215 0.244090 0.237756 0.256616 0.248834 0.209051 0.238077 0.373733 0.170632 0.341251 -0.035373 -0.123090
polarizability: 1.85768790e+02 -1.77843642e+01 1.21819531e+02 -3.70849544e+00 5.50337054e+00 1.32361224e+02
1716.lowfreq: -4.3911 -0.0009 -0.0002 0.0006 1.7633 3.0174 5.3643 20.1585 24.4099
frequency: 5.0431 20.1332 24.3744 37.5702 41.7297 45.3899 61.0615 67.0845 75.1757 88.4827 113.9654 123.8580 128.0111 135.9036 153.6469 166.6116 175.3202 179.3858 194.2091 204.6202 210.4299 232.3013 244.8280 249.4056 254.4510 272.4229 278.8529 288.0889 290.5654 299.9648 304.7478 315.4844 317.9985 321.9161 330.5966 362.3069 375.7074 392.0469 398.0886 414.8472 426.7397 446.7861 463.4510 486.0603 514.1913 516.3465 556.5028 557.4838 573.9176 578.8675 586.5858 590.3934 627.4655 654.2297 691.3359 781.0106 810.2407 831.3544 860.7289 876.0650 909.7466 933.6580 961.8927 977.7444 982.1150 995.8955 1011.2616 1012.9695 1021.4326 1029.9109 1034.1342 1043.7160 1047.6183 1054.6784 1072.1656 1081.8887 1085.5242 1095.2397 1114.4670 1129.7887 1139.5853 1149.5029 1157.6975 1181.1868 1189.2778 1242.2059 1288.3417 1373.6943 1401.2302 1417.7508 1448.8867 1458.5998 1472.1339 1620.9643 1652.5315 2993.3933 3031.1169 3077.4648 3096.6491 3102.4788 3107.1996 3219.3235
redmass: 6.2067 5.5536 10.3437 12.5933 6.7438 16.6056 9.0916 4.6773 15.6525 10.0042 16.7210 9.5770 18.0781 13.4206 8.8285 4.1917 2.4048 1.7554 16.1450 9.4723 17.2257 16.8860 17.2394 16.9585 14.4986 14.3217 16.4439 15.2283 18.0937 18.0077 15.4795 7.4087 11.2051 6.0772 17.9525 6.0773 3.2587 3.6651 9.8674 12.1869 13.9587 15.1559 17.5679 6.4305 15.4683 9.0806 15.3585 13.1030 7.0954 7.3920 17.0973 16.2090 1.5345 17.0178 7.0168 2.0741 13.0263 7.5498 10.9963 2.9346 8.5106 2.8209 6.7711 12.2415 5.9646 1.3137 1.8945 3.8061 8.7465 12.0321 10.3638 11.8389 11.9226 1.5060 5.2236 4.2329 11.5505 5.2691 12.5161 12.2611 11.5424 11.4866 11.9040 5.2529 12.2934 1.1898 3.5510 1.5404 1.1637 1.2522 1.0706 1.0438 1.0617 10.5947 5.3210 1.0364 1.0577 1.0972 1.1057 1.1007 1.0623 1.1159
irintensity: 0.5187 0.9911 0.1237 0.1584 0.5503 0.0059 0.5221 2.1297 0.9612 0.6621 0.2837 3.2298 0.8971 1.2907 4.9725 3.0742 1.3489 2.4891 16.8620 0.1526 10.8423 0.7192 1.1672 0.2685 0.3690 4.3050 1.1527 1.0108 0.7149 0.0036 0.9001 3.4918 2.5677 0.0934 0.3766 3.1346 0.8344 0.1214 6.0172 6.9355 0.5621 3.3472 7.1753 8.2163 3.0900 12.0205 2.3092 8.5276 13.7532 3.0288 1.6814 0.5834 10.2314 49.7895 46.6951 7.9631 317.3799 27.4779 13.2191 65.8472 121.7435 26.9627 71.0750 4.2110 33.9635 55.9267 130.4230 129.1483 9.8157 71.1720 39.3349 117.1211 40.8569 7.1950 143.6942 311.7021 197.8703 467.0654 3.5647 19.9956 17.5979 32.8775 2.2142 22.9965 47.6431 21.2662 75.7119 20.0262 22.7270 11.3302 9.2485 16.2703 45.5011 138.8074 7.4667 12.0039 14.6866 12.3934 1.4805 23.5521 2.8771 4.1869
temp: 298.150 k
press: 1.00000 atm
elementType: 9 9 9 9 9 9 9 9 9 9 9 9 9 9 9 8 8 6 6 6 6 6 6 6 6 6 6 6 6 1 1 1 1 1 1 1
symmnumber: 1
zpe: 496710.1 jmol-1
zpe.correction: 0.189187 hartree
zpe.thermalcorrener: 0.219173 hartree
zpe.thermalcorrenthalpy: 0.220117 hartree
zpe.thermalcorrgfe: 0.124844 hartree
zpe.sumelectzpe: -2107.244222 hartree
zpe.sumelectthermal: -2107.214236 hartree
zpe.sumelectthermalent: -2107.213292 hartree
zpe.sumelectthermalfe: -2107.308566 hartree
dipole: 2.5509 -0.8178 0.3712
dipole: 2.7044
quadrupole: -142.9254 -168.1103 -170.5302
quadrupole: -3.8579 7.4491 -3.1851
quadrupole: 17.5966 -7.5884 -10.0082 -3.8579 7.4491 -3.1851
hfenergy: -2107.4334094 hartree
pointgroup: C01 [X(C12H7F15O2)]
dipole: 1.0034665 -0.3528356 0.0253486 debye
polarizability: 186.2765759|-14.6399188|119.4622809|-9.4314605|-0.6763542|134.210688 unknown
InChI: InChI=1S/C12H7F15O2/c1-4(2)5(28)29-3-6(13,14)7(15,16)8(17,18)9(19,20)10(21,22)11(23,24)12(25,26)27/h1,3H2,2H3
charge 0 multiplicity 1
36 atoms
F  -1.673309 1.860334 -0.802462
F  0.193622 1.089922 -1.869727
F  -0.100431 -1.402619 -0.834774
F  -1.879576 -0.590966 -2.010051
F  -0.509655 1.490314 1.665825
F  0.663381 2.771594 0.180605
F  -2.431875 -2.417873 -0.042323
F  -1.503319 -1.090964 1.563924
F  1.291263 -0.602018 1.379875
F  2.206958 1.409211 1.937736
F  -3.377461 0.887592 1.142313
F  -4.209097 -1.1941 1.578867
F  -5.863335 0.082007 -0.071986
F  -4.226945 0.752957 -1.482607
F  -4.73819 -1.455182 -1.302239
O  3.839615 -0.046812 0.292886
O  4.73693 -0.016497 -1.854966
C  -0.598407 0.952821 -0.693404
C  -1.196389 -0.507425 -0.770488
C  0.3002 1.435514 0.51254
C  -2.181304 -1.074263 0.326498
C  1.637756 0.676865 0.857069
C  -3.585539 -0.395559 0.592642
C  2.637225 0.558584 -0.29065
C  -4.61203 -0.256188 -0.594775
C  4.872731 -0.300905 -0.642512
C  6.055478 -0.920213 0.029659
C  6.00224 -1.177313 1.520696
C  7.123901 -1.217236 -0.762236
H  2.241639 -0.077574 -1.10026
H  2.862969 1.556513 -0.706392
H  5.835491 -0.239719 2.080427
H  5.164248 -1.848692 1.779503
H  6.943212 -1.634513 1.869248
H  8.028399 -1.673632 -0.346726
H  7.101806 -1.005564 -1.836836
