program: Gaussian 09
title: 000077459
version: EM64L-G09RevD.01
frameworkgroup: C1[X(C10H10N4O4)]
method: RPBEPBE
basis: SDD
operation: Freq
keyword: #p
keyword: freq=noraman
keyword: PBEPBE/SDD
title: #p freq=noraman PBEPBE/SDD
converged: YES YES NO NO
title: Mulliken charges:
elementType: O O O O N N N N C C C C C C C C C C H H H H H H H H H H
charge: -0.221929 -0.222041 -0.215061 -0.215044 -0.159324 -0.159503 0.094677 0.094563 0.207814 0.207383 -0.321848 -0.321625 0.187876 0.188058 -0.235953 -0.236121 -0.623639 -0.623656 0.251670 0.251695 0.242216 0.242223 0.274697 0.264002 0.255077 0.274717 0.263977 0.255097
chargesum: 0.00000
title: Mulliken charges with hydrogens summed into heavy atoms:
elementType: O O O O N N N N C C C C C C C C C C
charge: -0.221929 -0.222041 -0.215061 -0.215044 -0.159324 -0.159503 0.094677 0.094563 0.207814 0.207383 -0.070178 -0.069929 0.187876 0.188058 0.006263 0.006102 0.170137 0.170134
polarizability: 2.06987257e+02 1.88462296e-02 1.70793529e+02 1.19316719e+01 -1.10256496e-02 9.99249393e+01
1716.lowfreq: -7.3772 -4.7605 -1.9584 -0.0006 -0.0006 -0.0003 11.0601 49.0742 55.3544
frequency: 10.9074 49.0740 55.3438 66.6546 75.3312 111.0657 117.7814 118.2019 158.1962 159.8741 175.5047 209.0251 236.0625 268.2481 310.2116 317.4815 333.4110 349.3747 374.1562 374.7560 390.2080 400.9945 454.5098 468.8113 560.1709 572.8673 641.3886 684.4053 689.0101 707.3634 766.9255 771.9201 777.7334 780.8779 856.5114 868.0151 879.7959 938.5434 939.3046 955.7053 994.3719 1044.3295 1102.0184 1113.6937 1113.7626 1138.1955 1142.5069 1184.1249 1192.6142 1214.9833 1285.1819 1310.3099 1316.5420 1370.5251 1371.8577 1375.6314 1411.8517 1412.4615 1428.8829 1461.8937 1461.9712 1468.2407 1468.8772 1477.7740 1576.3355 1583.6336 1599.6675 1602.0088 3010.1733 3010.2188 3097.5239 3097.5623 3142.9557 3150.6586 3150.7010 3157.3673 3171.0514 3180.2017
redmass: 11.7349 5.8278 4.1412 4.0720 6.0122 2.2912 1.6037 1.1084 4.8815 12.9993 6.5799 6.6334 7.7287 6.2893 4.7890 3.8362 4.7130 4.9471 7.1164 5.2461 6.9645 4.0230 7.6374 7.3555 6.0856 5.6092 5.7342 5.6291 8.0013 4.1393 6.1094 3.4077 1.9461 4.5239 3.6813 3.2791 1.4582 4.5096 5.1189 1.5242 1.3499 2.5065 3.2618 1.3412 1.3398 2.6101 1.9795 1.0758 2.5713 2.6152 1.4665 5.3586 4.5455 7.9630 8.2125 11.1118 1.2636 1.2438 2.0969 1.0490 1.0596 1.1252 1.0779 2.3353 7.0388 10.4363 10.5439 6.4247 1.0333 1.0333 1.1011 1.1010 1.0863 1.1014 1.1014 1.0908 1.0948 1.1003
irintensity: 0.3117 0.6441 2.5590 9.4568 0.0989 1.6687 1.1538 0.0913 1.4459 2.3671 2.9159 0.0818 12.7775 17.3555 0.1920 5.4625 13.3668 12.6931 1.3587 11.4448 4.5381 1.3591 11.4285 0.2861 29.8839 1.7962 4.8492 70.5164 0.8581 38.3312 0.4489 51.7861 171.7628 12.4882 3.8943 228.0573 0.6343 383.1081 7.2807 26.8386 0.3373 1.8315 80.6270 0.4028 0.1629 8.8307 24.3494 0.2254 17.9178 23.3995 4.9028 317.1203 73.6103 260.0317 1.0582 10.4588 47.9628 94.6061 0.0330 32.3415 8.7728 4.2078 69.1742 0.5031 33.7168 138.0377 71.4226 14.7810 13.3368 8.2282 15.0180 4.0877 0.4042 0.3284 0.3992 10.7431 13.4319 8.7970
temp: 298.150 k
press: 1.00000 atm
elementType: 8 8 8 8 7 7 7 7 6 6 6 6 6 6 6 6 6 6 1 1 1 1 1 1 1 1 1 1
symmnumber: 1
zpe: 516597.7 jmol-1
zpe.correction: 0.196762 hartree
zpe.thermalcorrener: 0.214459 hartree
zpe.thermalcorrenthalpy: 0.215403 hartree
zpe.thermalcorrgfe: 0.149140 hartree
zpe.sumelectzpe: -905.528859 hartree
zpe.sumelectthermal: -905.511161 hartree
zpe.sumelectthermalent: -905.510217 hartree
zpe.sumelectthermalfe: -905.576480 hartree
dipole: -0.0012 1.1247 -0.0003
dipole: 1.1247
quadrupole: -109.0466 -87.1852 -109.8505
quadrupole: -0.0163 -19.4133 0.0045
quadrupole: -7.0191 14.8422 -7.8231 -0.0163 -19.4133 0.0045
hfenergy: -905.7256202 hartree
pointgroup: C01 [X(C10H10N4O4)]
dipole: -0.0006679 0.4424814 -0.0000326 debye
polarizability: 208.1936638|0.0331516|170.7935518|3.4273076|-0.0043809|98.7185102 unknown
InChI: InChI=1S/C10H10N4O4/c1-13(11-17)9(15)7-5-3-4-6-8(7)10(16)14(2)12-18/h3-6H,1-2H3
charge 0 multiplicity 1
28 atoms
O  -0.55492 -1.501925 1.416408
O  0.55306 -1.504278 -1.410712
O  -4.487262 -0.435254 -0.638528
O  4.489985 -0.431131 0.63214
N  -2.611397 -0.936413 0.492117
N  2.611311 -0.935826 -0.492211
N  -3.291753 -0.066629 -0.406387
N  3.293333 -0.064197 0.403258
C  -0.651388 0.640312 0.292003
C  0.650708 0.639926 -0.290313
C  -1.281976 1.871071 0.589907
C  1.281476 1.870321 -0.589447
C  -1.233352 -0.662941 0.765425
C  1.232269 -0.663996 -0.762168
C  -0.639761 3.093346 0.298348
C  0.639452 3.092966 -0.299068
C  -3.270363 -2.150711 1.009209
C  3.270044 -2.150162 -1.009558
H  -2.267562 1.876164 1.062958
H  2.26705 1.874822 -1.062519
H  -1.138238 4.039034 0.53409
H  1.138058 4.038351 -0.535748
H  -2.540254 -2.684467 1.632952
H  -3.593981 -2.786448 0.167545
H  -4.162663 -1.87358 1.595488
H  2.538767 -2.685443 -1.630614
H  3.596575 -2.784517 -0.167976
H  4.16048 -1.872896 -1.598599
