program: Gaussian 09
title: 000004637
version: EM64L-G09RevD.01
frameworkgroup: C1[X(C19H27NO4)]
method: RPBEPBE
basis: SDD
operation: Freq
keyword: #p
keyword: freq=noraman
keyword: PBEPBE/SDD
title: #p freq=noraman PBEPBE/SDD
converged: YES YES NO NO
title: Mulliken charges:
elementType: O O O O N C C C C C C C C C C C C C C C C C C C H H H H H H H H H H H H H H H H H H H H H H H H H H H
charge: -0.467096 -0.461263 -0.315632 -0.305873 -0.113090 0.194687 0.297449 -0.299389 -0.544087 -0.521672 -0.523577 0.140694 -0.623402 -0.062734 -0.428468 -0.470656 0.329046 0.031898 -0.633815 -0.400936 0.176356 -0.390363 -0.558873 -0.526026 0.252983 0.264871 0.245004 0.234561 0.236649 0.208185 0.233951 0.241849 0.229032 0.199555 0.219570 0.215043 0.179151 0.241725 0.355983 0.230387 0.195517 0.226437 0.238541 0.327873 0.250458 0.226606 0.268894 0.257035 0.227358 0.217740 0.251864
chargesum: 0.00000
title: Mulliken charges with hydrogens summed into heavy atoms:
elementType: O O O O N C C C C C C C C C C C C C C C C C C C
charge: -0.111113 -0.133390 -0.315632 -0.305873 -0.113090 0.194687 0.297449 -0.046406 -0.034212 -0.050462 -0.081440 0.140694 -0.152521 0.136822 0.006145 -0.049780 0.329046 0.031898 0.018526 -0.162395 0.176356 -0.139905 0.193662 0.170936
polarizability: 2.48361866e+02 -4.00581970e+00 2.17145638e+02 6.86327812e+00 -1.48187014e+01 1.84221664e+02
1716.lowfreq: -0.0006 -0.0004 -0.0003 2.9409 7.5512 23.0487 45.2190 56.5467 76.1731
frequency: 44.8687 56.2413 76.1508 97.7511 101.7041 124.3922 136.5554 147.4696 160.1720 166.5446 182.4697 195.1917 216.2079 231.5232 237.7740 250.2701 257.9959 268.6095 289.8891 306.1636 312.8038 318.5626 327.6560 342.7846 351.3959 359.9417 374.4619 397.2713 436.8793 447.5229 460.4537 469.1428 479.7510 488.6787 531.5287 539.4341 574.2228 584.4655 599.9474 632.7187 661.9139 680.7560 695.1672 708.6790 741.7797 762.7929 770.7631 806.0580 821.3010 829.9312 863.5467 879.7307 891.7353 927.9011 938.5834 945.7277 949.7118 961.2205 981.8455 989.0655 1004.1204 1010.6630 1026.1106 1039.6854 1054.2396 1076.1639 1083.0384 1099.9475 1110.2512 1111.5758 1116.7244 1119.0639 1121.2489 1131.6140 1142.3974 1151.7948 1153.1954 1159.5723 1164.8906 1176.2733 1194.8487 1213.1385 1223.1899 1225.6057 1233.5767 1244.0509 1256.3574 1262.9728 1271.7362 1292.2550 1306.2745 1311.0966 1313.9859 1331.8361 1336.0573 1346.6619 1355.1938 1358.7793 1367.4515 1386.4299 1390.2300 1396.6343 1420.6746 1432.5591 1440.4520 1445.6756 1452.8238 1457.0185 1459.8953 1461.6538 1465.9500 1468.2209 1470.4245 1475.1997 1482.3397 1483.0693 1486.3481 1494.5845 1574.8788 1590.8062 2886.6179 2904.5453 2918.4066 2964.3917 2968.1305 2968.6808 2984.9010 2991.9806 2994.0383 3000.4035 3006.9036 3019.4058 3023.6370 3024.8143 3045.1915 3061.7511 3064.0947 3065.7065 3076.6618 3089.7594 3117.6944 3118.7944 3118.9408 3131.5844 3162.5061 3286.6751 3546.7845
redmass: 4.0929 3.8850 4.2508 3.5103 3.4001 2.7637 1.3816 2.0997 2.0925 1.3666 2.7337 3.9445 2.1510 1.4149 2.7346 3.6583 3.3681 4.1323 1.5160 2.2873 3.8033 3.5542 2.6298 3.2978 3.6380 3.2001 4.1911 4.3752 2.8951 3.7527 4.1373 3.5107 2.7406 3.2232 4.3595 2.9878 3.5472 3.6526 3.9170 4.0198 4.5613 1.7255 3.6563 1.9068 2.8507 3.3622 4.7753 1.9245 1.6413 2.6039 3.8593 2.3495 2.9857 2.1609 2.2782 1.5698 3.2507 2.6212 2.9406 3.1341 2.5511 2.5570 2.8034 2.1045 1.8201 2.2544 2.2122 2.4946 1.6338 1.2485 1.4580 1.8614 1.8604 2.0874 1.4686 1.5963 1.4894 1.6871 1.9359 1.4330 2.3942 1.6416 1.4790 1.4834 2.2822 1.9512 2.1970 1.6347 1.5156 1.6544 1.3987 1.3109 1.3798 1.7291 1.4971 2.9900 1.3619 1.4332 1.4340 2.2255 2.1885 1.6812 1.2447 1.1639 1.2746 1.2291 1.1941 1.0599 1.0861 1.4418 1.0851 1.1619 1.0992 1.0692 1.0712 1.0740 1.0845 1.0648 7.0745 6.9976 1.0539 1.0690 1.0831 1.0616 1.0320 1.0637 1.0293 1.0777 1.0673 1.0626 1.0970 1.0763 1.0808 1.0747 1.0994 1.0999 1.1023 1.1030 1.1010 1.1047 1.1027 1.1038 1.0893 1.0928 1.0956 1.0637 1.0659
irintensity: 0.1264 0.7909 1.8347 0.9663 4.1563 2.3130 0.1471 0.7355 5.9914 1.9538 1.9879 6.0611 5.3640 1.9008 1.7720 5.6010 3.8346 6.7035 61.9631 35.5379 5.4195 6.8113 11.0897 10.3841 30.2358 1.0458 2.6400 1.3544 3.9350 0.7542 2.0405 10.2531 0.8497 1.8070 3.8347 0.5587 3.0552 15.3005 2.3996 2.7396 5.3980 45.5363 6.7244 30.7743 7.5025 17.7438 8.0966 2.9472 30.0839 18.4535 14.3565 5.2888 12.3697 34.1058 9.3719 1.7706 101.3540 9.4165 30.9985 37.3408 70.2099 10.6615 29.8831 44.8525 2.7179 38.7301 1.5812 32.2072 0.5910 9.7332 11.7226 7.6883 9.7757 15.3946 5.3512 16.3074 4.8940 7.3059 6.9646 19.7456 20.0148 14.2354 0.9868 19.3471 26.8019 58.4951 30.3355 21.3329 6.0459 9.3186 16.8408 3.0073 29.2697 4.0082 5.4067 1.4632 15.8775 7.6768 15.1543 62.0306 25.1268 0.9762 2.0851 6.4880 19.6077 64.3383 6.1127 7.6009 3.9635 22.0985 5.4304 42.2964 9.5163 8.2190 13.3393 3.8687 22.2255 13.0827 1.2818 4.1243 85.8439 78.1201 70.0869 16.6948 90.4827 46.6135 53.5372 19.0234 54.5509 10.6693 31.2447 47.4862 23.6397 50.3135 18.0398 28.9765 35.3608 27.0548 27.6143 12.2280 26.9211 14.1654 16.1649 5.2007 10.4470 96.1448 1.5597
temp: 298.150 k
press: 1.00000 atm
elementType: 8 8 8 8 7 6 6 6 6 6 6 6 6 6 6 6 6 6 6 6 6 6 6 6 1 1 1 1 1 1 1 1 1 1 1 1 1 1 1 1 1 1 1 1 1 1 1 1 1 1 1
symmnumber: 1
zpe: 1131441.7 jmol-1
zpe.correction: 0.430943 hartree
zpe.thermalcorrener: 0.453698 hartree
zpe.thermalcorrenthalpy: 0.454642 hartree
zpe.thermalcorrgfe: 0.382014 hartree
zpe.sumelectzpe: -1093.978168 hartree
zpe.sumelectthermal: -1093.955414 hartree
zpe.sumelectthermalent: -1093.954470 hartree
zpe.sumelectthermalfe: -1094.027098 hartree
dipole: -0.0941 -3.3919 1.1201
dipole: 3.5733
quadrupole: -140.8069 -139.2524 -138.4159
quadrupole: -8.0790 7.3096 8.1853
quadrupole: -1.3152 0.2393 1.0759 -8.0790 7.3096 8.1853
hfenergy: -1094.4091113 hartree
pointgroup: C01 [X(C19H27N1O4)]
dipole: 0.1183097 -1.3324267 -0.4325211 debye
polarizability: 247.6365261|5.5705717|217.8483985|6.8416921|15.0924024|184.2442439 unknown
InChI: InChI=1S/C19H27NO4/c1-20-9-8-18-11-13(21)6-7-19(18,22)15(20)10-12-4-5-14(23-2)17(24-3)16(12)18/h4-5,13,15,21-22H,6-11H2,1-3H3
charge 0 multiplicity 1
51 atoms
O  -3.145979 0.98095 0.540213
O  0.110709 4.141724 -0.069774
O  2.203023 0.773444 1.177737
O  4.206413 -0.655944 -0.235254
N  -2.688165 -1.67452 0.812245
C  -0.698192 0.463092 0.568319
C  -2.045802 0.414586 -0.263143
C  -2.409299 -1.063804 -0.529663
C  -0.414953 1.968621 0.842356
C  -0.944869 -0.274754 1.924787
C  -1.969654 1.255191 -1.553466
C  0.431825 -0.301186 -0.17109
C  -1.33148 -1.745646 -1.404033
C  -0.27313 2.767258 -0.458985
C  -1.503237 -1.698068 1.719183
C  -1.591364 2.725581 -1.254002
C  0.10866 -1.339429 -1.09881
C  1.817488 -0.095828 0.127912
C  -3.392349 -2.969319 0.747629
C  1.132379 -2.048323 -1.773783
C  2.831337 -0.853318 -0.527071
C  2.490382 -1.803715 -1.506984
C  3.04461 1.939679 0.795473
C  4.621282 -1.140222 1.101491
H  -3.375347 -1.089746 -1.0726
H  0.475021 2.091043 1.472412
H  -1.286718 2.371183 1.390759
H  -1.658525 0.321436 2.523308
H  0.004389 -0.322676 2.488819
H  -2.955543 1.212521 -2.05256
H  -1.221566 0.819389 -2.242591
H  -1.554676 -1.516462 -2.465615
H  -1.423552 -2.847053 -1.316163
H  0.536102 2.331961 -1.089405
H  -0.70736 -2.375892 1.329956
H  -1.833483 -2.11116 2.691092
H  -1.494367 3.287244 -2.206511
H  -2.388208 3.200082 -0.652581
H  -3.467145 0.189914 1.073912
H  -3.725708 -3.257851 1.760871
H  -2.764832 -3.802589 0.348913
H  -4.285719 -2.874694 0.104815
H  0.853388 -2.819949 -2.501602
H  0.035989 4.72686 -0.866808
H  3.291777 -2.354422 -2.009126
H  3.43686 2.337157 1.74456
H  2.421077 2.708721 0.30534
H  3.872413 1.619805 0.14027
H  5.690751 -0.892978 1.185638
H  4.482749 -2.236498 1.169222
H  4.0437 -0.6372 1.897688
