program: Gaussian 16
title: Title Card Required
version: EM64L-G16RevC.01
frameworkgroup: C1[X(C18H24N)]
method: RM062X
basis: Gen
operation: Freq
keyword: #pfreq=noraman
keyword: gen
keyword: integral=grid=ultrafine
keyword: m062x
title: #p freq=noraman gen integral=grid=ultrafine m062x
basis: NPDir=0 NMtPBC= 1 NCelOv= 1 NCel= 1 NClECP= 1 NCelD= 1
basis: NCelK= 1 NCelE2= 1 NClLst= 1 CellRange= 0.0.
basis: One-electron integrals computed using PRISM.
basis: One-electron integral symmetry used in STVInt
basis: NBasis= 733 RedAO= T EigKep= 6.12D-06 NBF= 733
basis: NBsUse= 733 1.00D-06 EigRej= -1.00D+00 NBFU= 733
converged: YES YES NO YES
title: Mulliken charges:
elementType: C C C C C C H H H H H N H C H C H H C C C C H C H C H H H C C H H H C H H H C H H H H
charge: -0.146491 -0.236143 0.213584 -0.213540 -0.147186 -0.129851 0.176621 0.237292 0.214860 0.176917 0.177420 -0.247091 0.302777 -0.139228 0.271018 -0.534368 0.227319 0.228936 0.144682 -0.276558 -0.167035 -0.136414 0.181866 -0.136587 0.168373 -0.158105 0.172909 0.169274 0.171762 -0.069962 -0.422261 0.138331 0.195368 0.169939 -0.462298 0.182297 0.176360 0.179830 -0.488202 0.181550 0.200776 0.153754 0.297507
chargesum: 1.00000
title: Mulliken charges with hydrogens summed into heavy atoms:
elementType: C C C C C C N C C C C C C C C C C C C
charge: 0.030130 0.001149 0.213584 0.001320 0.029731 0.047569 0.353193 0.131789 -0.078113 0.144682 -0.094692 0.001337 0.036495 0.032686 0.013657 -0.069962 0.081377 0.076189 0.047878
polarizability: 2.42176988e+02 -2.40515543e+00 1.93357101e+02 3.47398247e+00 2.01624735e+01 1.61682899e+02
1716.lowfreq: -6.9603 -3.7858 -1.8991 -0.0005 0.0002 0.0008 21.5224 46.3740 67.2786
frequency: 21.3584 46.3190 67.2709 73.0948 86.5588 103.0931 123.1391 183.1116 214.5561 224.6221 251.2996 275.3371 277.1626 294.4809 326.2000 337.5331 362.0461 383.6574 398.6309 415.5198 416.4038 443.7501 461.2916 493.1051 526.2347 532.2821 600.2292 604.4599 628.9597 632.8497 713.6396 728.5643 758.2468 772.2510 787.2430 823.5251 848.5385 860.0544 861.0710 884.7297 885.7516 943.8744 953.2373 954.3091 962.5490 965.0104 973.5018 1007.2243 1010.0101 1017.7431 1022.7275 1024.1309 1038.3159 1044.1648 1046.4410 1057.2566 1062.3382 1063.4682 1087.7194 1119.4712 1125.6723 1181.9699 1187.2001 1196.2299 1201.9890 1210.0989 1213.4565 1241.4907 1243.7126 1263.6693 1277.3117 1291.5234 1327.2674 1333.8993 1339.8197 1350.3039 1362.3586 1380.8420 1398.3636 1413.4128 1416.9133 1421.9793 1449.1830 1476.3956 1481.9148 1484.0854 1495.8867 1500.5595 1514.1221 1518.8407 1519.1122 1524.5973 1541.7939 1543.5800 1608.4090 1655.6233 1668.3139 1675.5399 1686.2885 3043.2338 3052.8692 3065.6964 3090.2302 3111.6469 3113.6008 3124.9495 3139.1686 3141.1512 3146.5497 3155.1291 3156.5661 3177.3271 3188.2922 3206.2671 3213.7342 3220.3958 3220.9310 3228.6045 3233.5250 3235.8035 3241.4287 3398.4329 3467.2339
redmass: 4.1294 3.3512 3.4310 3.1715 3.8312 4.1087 3.2677 3.5612 2.0442 1.8641 3.4471 1.9557 2.9759 1.1718 1.2660 2.3321 2.0234 2.2075 1.9933 2.8342 2.8728 2.8974 2.6754 2.7645 2.9367 3.1173 4.2575 4.4748 6.1310 6.2770 2.3049 1.9733 1.8843 1.9120 1.9767 3.2362 3.5275 2.0274 1.4637 1.9126 1.2601 1.7714 1.4623 1.4590 1.6009 1.5170 1.2341 2.6487 1.3805 1.5778 3.6582 5.3709 1.6423 1.3324 1.3386 1.5721 2.1218 2.1143 2.0524 1.5814 1.4906 1.2325 1.1748 1.2698 1.7613 1.1278 1.5156 1.8080 2.1870 2.8102 2.1275 1.7462 1.7367 3.0135 2.0781 1.6032 1.3095 1.2514 1.4777 1.2521 1.2052 1.2332 1.2203 1.0473 1.0773 1.0599 1.0728 2.0801 1.0874 1.1368 1.4832 1.2943 2.2510 2.3520 1.0813 5.7560 5.8048 5.9054 6.1487 1.0428 1.0451 1.0382 1.0623 1.0890 1.0928 1.0910 1.1010 1.1021 1.1007 1.1023 1.1016 1.0898 1.0898 1.0912 1.0894 1.0882 1.0937 1.0908 1.0981 1.0947 1.0988 1.0587 1.0868
irintensity: 0.2318 0.1928 0.1988 0.3535 0.1859 1.2333 1.0611 1.3124 0.6115 0.6971 2.6536 0.1266 5.3889 0.0247 0.8913 7.2329 0.6760 0.2688 14.8045 0.9384 0.2324 0.3788 4.6143 2.3640 11.7056 19.8281 2.1361 3.3861 0.9399 0.0779 23.0522 46.6770 9.8883 26.6405 46.9462 1.2495 1.6307 5.1450 0.5365 13.6695 0.1048 1.4896 4.3663 2.7272 0.5657 3.8525 0.5467 25.0175 0.5076 0.9854 2.7159 1.8143 4.5025 0.1073 0.0487 3.0922 0.9581 1.4167 8.4236 0.9468 9.0108 0.1154 1.0659 0.1474 5.3248 0.2732 2.7299 7.5925 0.6442 2.9227 26.8859 1.0240 7.2438 2.7818 7.9564 13.0800 3.5642 2.9147 14.5389 2.4591 40.7323 27.1666 11.0010 1.1140 0.2515 2.1073 1.1955 10.4201 13.1921 9.5464 19.1377 21.7032 27.4151 9.8835 74.7553 1.2851 2.9759 3.1131 3.6635 16.9576 26.9183 3.5861 3.6291 4.5204 10.4225 14.5930 7.1229 0.1646 14.3534 0.4841 18.1586 3.6830 2.3988 2.7345 0.0865 0.2478 1.2259 0.1308 0.4787 0.3559 0.0824 45.1003 110.6017
temp: 298.150 k
press: 1.00000 atm
elementType: 6 6 6 6 6 6 1 1 1 1 1 7 1 6 1 6 1 1 6 6 6 6 1 6 1 6 1 1 1 6 6 1 1 1 6 1 1 1 6 1 1 1 1
symmnumber: 1
zpe: 1011910.1 jmol-1
zpe.correction: 0.385416 hartree
zpe.thermalcorrener: 0.403170 hartree
zpe.thermalcorrenthalpy: 0.404114 hartree
zpe.thermalcorrgfe: 0.339646 hartree
zpe.sumelectzpe: -754.452378 hartree
zpe.sumelectthermal: -754.434625 hartree
zpe.sumelectthermalent: -754.433680 hartree
zpe.sumelectthermalfe: -754.498148 hartree
dipole: 1.9327 1.4815 -1.3763
dipole: 2.7972
quadrupole: -76.5319 -96.4651 -105.0055
quadrupole: -2.1739 -0.4313 5.4371
quadrupole: 16.1356 -3.7976 -12.3380 -2.1739 -0.4313 5.4371
hfenergy: -754.8377943 hartree
pointgroup: C01 [X(C18H24N1)]
dipole: -0.7603674 0.5828751 0.5414805 debye
polarizability: 242.1769878|2.4051546|193.3571011|3.4739821|-20.1624736|161.6828994 unknown
InChI: InChI=1/C18H24N/c1-18(2,3)17(14-15-10-6-4-7-11-15)19-16-12-8-5-9-13-16/h4-13,17H,14,19H2,1-3H3
charge 1 multiplicity 1
43 atoms
C  2.661539 2.020305 0.527705
C  1.67692 1.101523 0.862531
C  0.373062 1.368563 0.492994
C  0.018644 2.514929 -0.196927
C  1.013385 3.424247 -0.523617
C  2.331477 3.177485 -0.162204
H  3.687894 1.822995 0.805419
H  1.932831 0.18449 1.380489
H  -1.009906 2.703221 -0.475694
H  0.754656 4.327475 -1.058878
H  3.102609 3.890433 -0.420562
N  -0.68541 0.405437 0.867438
H  -0.247063 -0.331603 1.42947
C  -1.46121 -0.262563 -0.279211
H  -1.193228 0.322529 -1.159928
C  -0.958535 -1.70233 -0.452195
H  -1.431849 -2.347832 0.28974
H  -1.299103 -2.04016 -1.431086
C  0.539349 -1.838869 -0.350571
C  1.115355 -2.412977 0.78017
C  1.369683 -1.363627 -1.363821
C  2.498184 -2.500208 0.90538
H  0.480177 -2.826755 1.557351
C  2.747104 -1.448067 -1.241272
H  0.934818 -0.929281 -2.257476
C  3.314669 -2.011744 -0.103243
H  2.932311 -2.962491 1.782172
H  3.381488 -1.081245 -2.037384
H  4.390294 -2.08639 -0.01421
C  -2.980292 -0.127978 -0.030126
C  -3.403428 -0.730033 1.314351
H  -2.965006 -0.217007 2.176097
H  -4.483874 -0.63347 1.422823
H  -3.165366 -1.790594 1.39132
C  -3.708043 -0.858687 -1.163501
H  -4.777079 -0.657168 -1.097126
H  -3.364132 -0.516555 -2.1422
H  -3.571201 -1.938112 -1.105026
C  -3.383814 1.349778 -0.071675
H  -3.134948 1.799738 -1.034988
H  -4.460951 1.439835 0.067979
H  -2.921671 1.951093 0.718196
H  -1.358128 0.88032 1.472835
