program: Gaussian 16
title: Title Card Required
version: ES64L-G16RevC.01
frameworkgroup: C1[X(C10H12)]
method: RB3LYP
basis: 6-31G(d)
operation: Freq
keyword: #NGeom=AllCheck
keyword: Guess=TCheck
keyword: SCRF=Check
keyword: GenChk
keyword: RB3LYP/6-31G(d)
keyword: Freq
converged: YES YES NO NO
title: Mulliken charges:
elementType: H C C C C C H C H H H C H H H C C H H C H H
charge: 0.165826 -0.340569 -0.136219 -0.105787 -0.102308 -0.130751 0.160273 -0.102338 0.124190 0.121161 0.121282 -0.130886 0.122822 0.122853 0.121317 -0.105604 -0.136159 0.121183 0.124186 -0.340565 0.165801 0.160293
chargesum: -0.00000
title: Mulliken charges with hydrogens summed into heavy atoms:
elementType: C C C C C C C C C C
charge: -0.014470 -0.012029 0.015374 0.018975 -0.007930 0.018979 -0.008033 0.015578 -0.011973 -0.014472
chargesum: 0.00000
1716.lowfreq: -4.7671 -3.8838 -0.0002 0.0002 0.0006 4.5667 32.4356 63.6457 76.4112
frequency: 32.4286 63.6456 76.4108 82.9069 86.3248 91.4062 341.6000 350.0636 520.0703 521.3869 680.7147 687.6537 706.6064 709.0751 814.8788 816.1509 818.8392 819.1858 928.2793 929.7708 934.0876 934.2510 942.7558 943.0042 946.4468 949.0696 981.1912 982.2209 1029.5229 1030.3719 1124.1022 1124.9529 1139.3713 1139.4902 1140.6623 1142.0040 1284.1287 1285.1536 1332.0623 1332.2403 1419.6825 1420.9439 1445.7069 1445.7790 1575.5029 1576.2758 1662.4258 1662.7764 3032.5434 3032.6903 3067.7082 3068.3088 3211.2122 3212.2014 3221.3279 3221.4374 3238.2129 3238.3478 3245.5232 3245.7257
redmass: 3.3214 3.5506 3.4827 5.8607 3.1438 3.2237 1.5416 1.5333 2.3564 2.3603 1.1683 1.1624 1.2964 1.3097 5.0532 5.0068 5.6089 5.5897 1.9915 1.9580 2.1144 2.1325 1.2624 1.2572 1.3407 1.3271 1.6180 1.6290 2.5973 2.5396 1.1248 1.1235 1.1211 1.1221 1.2508 1.2423 1.6432 1.6365 1.6909 1.6908 1.7901 1.8232 1.1678 1.1664 5.8993 5.8333 5.1632 5.1718 1.0651 1.0648 1.0944 1.0941 1.0858 1.0857 1.0880 1.0879 1.0999 1.0999 1.1061 1.1062
irintensity: 0.0142 0.2593 0.0037 0.0205 0.0154 0.0051 0.0230 22.8963 0.1668 0.2242 127.6978 0.2075 0.9603 0.6371 0.0004 0.0024 4.4474 4.4395 0.1582 34.9102 6.5098 7.1341 0.9421 1.4173 0.2125 0.0012 9.5182 7.2678 0.1165 0.0281 0.9560 1.4034 0.1694 0.1798 0.1393 0.2260 1.6511 1.0487 0.8343 0.9710 11.1649 11.8792 11.2029 12.1696 0.8147 2.8505 0.6291 0.4595 19.6039 11.4034 5.3415 27.3241 0.5059 3.4522 11.4273 12.5472 27.0330 25.7885 4.5321 3.9533
temp: 298.150 k
press: 1.00000 atm
elementType: 1 6 6 6 6 6 1 6 1 1 1 6 1 1 1 6 6 1 1 6 1 1
symmnumber: 1
zpe: 490701.1 jmol-1
zpe.correction: 0.186898 hartree
zpe.thermalcorrener: 0.197103 hartree
zpe.thermalcorrenthalpy: 0.198047 hartree
zpe.thermalcorrgfe: 0.149279 hartree
zpe.sumelectzpe: -388.052691 hartree
zpe.sumelectthermal: -388.042486 hartree
zpe.sumelectthermalent: -388.041542 hartree
zpe.sumelectthermalfe: -388.090310 hartree
dipole: 0.0022 -0.4560 -0.0036
dipole: 0.4560
quadrupole: -62.5650 -55.5915 -57.1543
quadrupole: 0.0071 -3.9900 0.0007
quadrupole: -4.1281 2.8455 1.2826 0.0071 -3.9900 0.0007
hfenergy: -388.2395889 hartree
pointgroup: C01 [X(C10H12)]
dipole: -0.0006103 -0.1793987 -0.0000303 debye
dipolederiv: 0.0775983 -0.055364 -0.0678616 -0.0558205 0.0307312 -0.0516466 -0.0724712 -0.053411 -0.0370322 0.143799 0.0191233 0.1323339 0.0575218 -0.1048437 -0.0417303 0.1745487 -0.0499784 -0.0226347 -0.1741649 -0.0457153 -0.092634 -0.0772227 0.0325033 0.0362101 -0.1685226 0.0435223 -0.0497615 -0.1476268 -0.0104587 -0.009497 0.0587015 0.2146513 -0.0451898 0.0350434 -0.0563114 -0.1022412 -0.0268318 0.0126782 -0.1553356 0.0515436 -0.1120567 -0.0333115 -0.1227076 -0.0562556 0.0876514 -0.1413105 -0.0140634 -0.1053062 -0.0916479 0.0011036 0.0462699 -0.1253779 0.0641655 -0.0386278 -0.10267 0.0878555 0.010868 0.0713948 0.0371966 -0.0006611 -0.0157503 0.0103414 0.0814509 -0.028041 -0.0132766 -0.1555412 -0.0518939 -0.1118172 0.0338849 -0.1230143 0.0563101 0.0874003 0.0846351 -0.0269776 0.0705769 -0.038596 0.0103137 0.0641016 0.0887512 0.0627429 -0.00728 0.1172757 0.0318887 0.0336701 0.0159742 -0.1099856 -0.022495 0.0370202 -0.010458 0.0747349 0.0678063 0.016182 0.1233125 0.0102825 0.0514606 -0.0115362 0.1125126 -0.0138993 -0.0284539 -0.1409954 0.0149318 -0.1055724 0.0929136 0.0012849 -0.0455994 -0.1259596 -0.0634639 -0.0386198 0.1013336 -0.0475102 0.0598721 -0.0334807 -0.0511812 0.0546618 0.0573216 0.0571101 0.0422539 0.1015688 0.0468728 0.0596388 0.0327757 -0.0513417 -0.0550029 0.0570709 -0.0574561 0.0421591 0.0677353 -0.0161957 0.1234664 -0.0104317 0.0515118 0.0112147 0.1127945 0.0137014 -0.028202 -0.1470704 0.0118281 -0.0093466 -0.057292 0.2142143 0.0453597 0.0347449 0.0564286 -0.1025466 -0.1735412 0.0464325 -0.0923634 0.0777691 0.032181 -0.0360241 -0.1684053 -0.0429569 -0.0495841 0.1171254 -0.0327376 0.0338272 -0.0169039 -0.1096485 0.0222035 0.0370959 0.0101171 0.0747835 0.0848934 0.0266779 0.0703077 0.0382875 0.0101747 -0.0643062 0.0886284 -0.0629724 -0.0073457 0.1438629 -0.0199551 0.1324596 -0.0584878 -0.1047961 0.0410298 0.1745992 0.0495508 -0.0225707 0.0775738 0.0553776 -0.0677319 0.0555936 0.0305765 0.0519893 -0.0721136 0.0535929 -0.0369913 -0.1029556 -0.0875941 0.0108567 -0.0709808 0.0377672 0.0005777 -0.0158088 -0.0104203 0.0814575 unknown
polarizability: 80.6728783|0.0857089|103.0081298|-21.8371831|0.0528454|88.5364697 unknown
InChI: InChI=1/2C5H6/c2*1-2-4-5-3-1/h2*1-4H,5H2
charge 0 multiplicity 1
22 atoms
H  1.66496226 -1.33715746 -1.13758733
C  2.16506326 -0.85910866 -0.28397956
C  2.21965027 0.63839837 -0.43557864
C  1.57599936 1.2109467 0.6020923
C  1.05852339 0.1639239 1.49126936
C  1.38619947 -1.04551386 0.99194311
H  3.17009194 -1.30408811 -0.22281485
C  -1.05740477 0.16050149 -1.49073579
H  2.70834877 1.14554547 -1.25928808
H  1.44254712 2.27443144 0.76918266
H  0.49496155 0.35645569 2.39751756
C  -1.38945401 -1.04823551 -0.99251013
H  1.14908835 -2.01306772 1.41862261
H  -1.15583891 -2.01627185 -1.42008847
H  -0.49268351 0.35175304 -2.39654232
C  -1.57170855 1.20861569 -0.60104533
C  -2.21770888 0.63747971 0.43593274
H  -1.43443403 2.27174104 -0.76724564
H  -2.70491355 1.14562171 1.25991071
C  -2.16794377 -0.8601024 0.28338685
H  -1.66929624 -1.34017211 1.13676846
H  -3.17430452 -1.30200055 0.22205377
