program: Gaussian 16
title: Title Card Required
version: ES64L-G16RevC.01
frameworkgroup: C1[X(C10H12)]
method: RB3LYP
basis: 6-31G(d)
operation: Freq
keyword: #NGeom=AllCheck
keyword: Guess=TCheck
keyword: SCRF=Check
keyword: GenChk
keyword: RB3LYP/6-31G(d)
keyword: Freq
converged: YES YES YES YES
title: Mulliken charges:
elementType: H C C C C C H C H H H C H H H C C H C H H H
charge: 0.125088 -0.262271 -0.145054 -0.097308 -0.111164 -0.145723 0.138642 -0.138448 0.113826 0.125067 0.123958 -0.108646 0.115099 0.128018 0.129356 -0.093575 -0.110246 0.118464 -0.302637 0.119947 0.138528 0.139081
chargesum: -0.00000
title: Mulliken charges with hydrogens summed into heavy atoms:
elementType: C C C C C C C C C C
charge: 0.001458 -0.031227 0.027758 0.012793 -0.030624 -0.009092 0.019372 0.024889 0.009701 -0.025029
chargesum: 0.00000
1716.lowfreq: -10.4639 -5.6099 -1.0076 -0.0004 0.0005 0.0006 143.5869 198.4298 327.2218
frequency: 143.5847 198.4296 327.2217 382.9286 466.9271 475.3984 489.7875 636.6818 690.9819 719.3270 743.8086 775.8362 793.5189 820.5861 837.3820 884.9708 913.7175 926.9231 943.4156 955.5232 964.8112 969.1525 974.4081 985.2058 1021.9792 1050.2056 1057.3829 1096.7075 1125.8782 1137.7410 1156.1963 1171.8992 1195.6871 1198.7980 1267.4923 1288.6595 1297.4917 1302.2844 1308.8002 1325.3121 1348.7407 1358.5916 1388.2131 1403.2560 1514.6257 1525.9035 1660.5489 1704.2405 3029.8213 3035.3562 3051.8037 3059.7026 3083.0819 3114.4135 3117.8626 3121.6080 3181.3168 3205.9494 3206.9927 3231.4409
redmass: 2.7600 3.6227 2.3274 3.0998 2.0242 3.4354 2.0618 3.8366 2.0366 2.8279 2.1253 2.0481 3.2118 3.9583 2.4182 3.6462 1.9364 2.1381 1.4975 2.3903 2.5316 1.3379 2.1757 1.6295 1.9105 1.9985 1.9261 1.9534 1.1980 1.0938 1.1092 1.3031 1.3172 1.5575 1.4336 1.5181 1.3954 1.6293 1.3336 1.3274 1.6530 1.5008 1.7231 1.7559 1.0954 1.1109 5.6808 6.1948 1.0601 1.0843 1.1016 1.0622 1.0867 1.0881 1.0957 1.0969 1.0845 1.1016 1.0872 1.1053
irintensity: 0.1091 0.0721 0.1122 0.6827 0.3491 0.0692 9.8378 0.2083 5.2589 4.0159 17.2283 32.0931 0.5187 4.6730 6.4956 0.8931 0.3733 4.3132 5.3173 0.6904 1.6239 0.5853 0.2904 0.2249 1.6656 3.0612 0.1861 0.2890 0.5227 0.4030 0.2088 2.2788 0.6419 1.2008 0.8660 2.1486 0.4338 2.7908 0.0815 1.2913 1.1054 4.0544 7.3739 0.3320 3.0037 1.7190 0.5070 1.1206 39.4914 32.8082 15.7018 40.3467 51.1901 68.2304 37.4173 39.4100 11.0106 29.9737 15.8187 20.4508
temp: 298.150 k
press: 1.00000 atm
elementType: 1 6 6 6 6 6 1 6 1 1 1 6 1 1 1 6 6 1 6 1 1 1
symmnumber: 1
zpe: 510605.1 jmol-1
zpe.correction: 0.194479 hartree
zpe.thermalcorrener: 0.201493 hartree
zpe.thermalcorrenthalpy: 0.202437 hartree
zpe.thermalcorrgfe: 0.163256 hartree
zpe.sumelectzpe: -388.078159 hartree
zpe.sumelectthermal: -388.071145 hartree
zpe.sumelectthermalent: -388.070201 hartree
zpe.sumelectthermalfe: -388.109382 hartree
dipole: -0.1013 -0.0617 -0.1325
dipole: 0.1778
quadrupole: -61.1781 -57.5025 -59.0583
quadrupole: 0.4411 -1.3360 0.0181
quadrupole: -1.9318 1.7438 0.1880 0.4411 -1.3360 0.0181
hfenergy: -388.2726383 hartree
pointgroup: C01 [X(C10H12)]
dipole: 0.0459188 -0.0400641 0.0343758 debye
dipolederiv: 0.0388464 0.0091185 -0.021693 -0.0207123 -0.0234525 0.1076449 0.0252874 0.1216092 -0.1261445 0.0851747 0.0152664 0.0657899 0.0596056 0.0116418 -0.1215211 0.0107084 -0.1297594 0.1308165 0.1389891 -0.0920245 -0.0935036 -0.1211129 0.0587903 0.145246 0.0061536 0.0977241 0.1000274 -0.2135836 0.0878482 0.0220706 -0.0156701 0.0607463 -0.0275644 0.0049914 -0.0448827 0.0484469 -0.1960285 -0.113301 -0.1069583 -0.0506343 -0.0387024 -0.0776437 -0.0452441 -0.0498941 0.0449215 0.0696001 0.0633491 0.0491263 -0.013651 0.2205946 0.0677445 0.0549975 0.1178935 0.0147393 -0.1848252 -0.037343 -0.0328532 -0.0152323 0.0332955 0.0099158 -0.0878775 -0.00772 0.0182129 0.0880099 0.0282828 0.0630484 0.00729 -0.0164984 -0.1237641 0.0299648 -0.0960598 0.1260591 -0.0439777 0.0647623 0.0562619 0.0789532 -0.0619506 -0.0838076 0.0529816 -0.0861409 -0.0597059 0.134901 -0.0156777 0.0126656 0.0276877 -0.0856584 0.0682297 -0.0057764 0.0651849 0.013717 0.12317 0.0219674 0.0753733 0.018388 0.0499993 0.0246297 0.0291874 0.0109706 -0.1031124 0.0854366 -0.0002442 0.0244649 0.0349107 -0.0001186 -0.069088 0.0404577 -0.0863735 0.0660967 0.0095088 -0.0087275 -0.0076535 -0.0151713 -0.160082 -0.0766664 -0.0264016 -0.0823683 -0.0120589 -0.032251 0.0344568 -0.016285 0.0106828 -0.1015417 0.0796243 -0.0223889 0.1263571 -0.0462843 -0.0336599 -0.015874 -0.0004361 -0.0468324 0.0200649 0.0669481 0.0185754 0.0131164 -0.1989737 -0.0403178 0.0410167 -0.0758334 0.1320154 0.0960142 0.116212 -0.122418 0.0308905 -0.1293787 -0.0324376 0.0768484 -0.1282184 0.0463761 0.0726397 0.0488198 -0.1123975 0.0550329 -0.0524803 0.055436 -0.0268865 0.0233043 -0.0597055 -0.1093696 -0.0893935 0.0330217 -0.0641135 0.0694771 0.0631558 -0.0921608 0.0879368 -0.0546125 0.0560189 -0.0293237 0.0525391 -0.0038621 0.1246639 -0.0524829 -0.0930737 0.073401 -0.1226741 -0.0123576 0.0111933 0.0957021 0.0163098 0.075453 -0.1204692 0.0919282 -0.020083 0.1217234 -0.0780461 -0.0140874 -0.0457638 0.0411617 0.0450185 0.0578049 -0.0395321 -0.0499255 -0.0016242 0.0079725 -0.0333482 0.0136997 -0.0450761 -0.1495109 unknown
polarizability: 92.4468305|-0.7218915|90.8876092|-8.1891104|5.6930459|85.7743289 unknown
InChI: InChI=1/C10H12/c1-2-9-7-4-5-8(6-7)10(9)3-1/h1-2,4-5,7-10H,3,6H2
charge 0 multiplicity 1
22 atoms
H  -1.79636936 -1.3926544 1.43315942
C  -1.84206532 -0.80868407 0.5058017
C  -1.27868552 0.62505508 0.65608281
C  -1.18730344 1.03192927 -0.80499405
C  -0.89413041 -0.06601873 -1.51427945
C  -0.77634738 -1.22634339 -0.53661618
H  -2.86049358 -0.82734331 0.1060661
C  0.1824378 0.2788008 1.14147016
H  -1.81718651 1.3085634 1.31652918
H  -1.2353661 2.05277009 -1.16841649
H  -0.66483778 -0.11864303 -2.57321936
C  0.52887312 -1.00718705 0.30595145
H  -0.86471944 -2.22738191 -0.9659514
H  0.6737957 -1.87097805 0.96183756
H  0.14819823 0.07760154 2.22042631
C  1.27418798 1.24881924 0.78709931
C  2.14515231 0.74132511 -0.08832392
H  1.32005805 2.25453332 1.19706574
C  1.82844108 -0.68392702 -0.4754417
H  3.00001539 1.2758928 -0.49523858
H  2.64796583 -1.36309173 -0.20349267
H  1.69539333 -0.78505397 -1.56139392
