program: Gaussian 16
title: Title Card Required
version: ES64L-G16RevC.01
method: RmPW1PW91
basis: 6-311G(d,p)
operation: Freq
keyword: #N
keyword: Geom=AllCheck
keyword: Guess=TCheck
keyword: SCRF=Check
keyword: GenChk
keyword: RmPW1PW91/6-311G(d,p)
keyword: Freq
converged: YES YES YES YES
title: Mulliken charges:
elementType: C H C H H C C H H C H H C C H C H H H C H H H C H H H O H H
charge: -0.233832 0.185211 -0.244493 0.174664 0.174432 -0.081835 -0.237950 0.171997 0.177697 -0.151180 0.156200 0.185290 -0.204546 -0.141866 0.171811 -0.241702 0.174778 0.167712 0.142834 -0.292436 0.163094 0.182380 0.156856 -0.206407 0.167647 0.152952 0.155942 -0.348171 0.340108 0.182816
chargesum: 1.00000
title: Mulliken charges with hydrogens summed into heavy atoms:
elementType: C C C C C C C C C C O
charge: -0.048620 0.104603 -0.081835 0.111744 0.190310 -0.204546 0.212760 0.243621 0.209893 0.270134 -0.008063
1716.lowfreq: -6.6348 -3.9769 -0.0006 -0.0005 0.0003 9.4570 47.0444 177.5038 202.5795
frequency: 47.0324 177.5028 202.5795 229.5362 231.2183 244.4459 270.1450 297.2081 330.8620 383.7434 402.7861 413.4865 426.2300 430.8818 469.2672 523.8474 553.6857 609.0352 635.2615 682.5077 771.8798 785.4661 801.8721 843.6195 887.4742 911.3046 933.4362 937.5577 943.3479 960.0233 1007.0214 1019.5264 1040.6551 1059.4322 1091.9474 1108.0172 1145.6188 1156.7409 1171.6204 1216.7159 1240.4043 1242.6928 1260.3446 1279.1633 1299.3718 1311.8215 1340.5421 1356.4587 1366.2187 1378.3284 1396.3099 1414.3376 1418.9157 1425.9100 1432.6473 1469.9053 1476.3445 1482.0403 1486.0255 1493.9886 1497.3303 1504.7633 1506.1511 1514.0343 1535.6759 3061.5432 3065.1246 3067.5438 3077.7085 3086.4377 3093.2281 3099.1511 3105.4380 3115.8684 3128.1983 3139.9173 3141.3791 3142.7253 3147.6625 3153.8060 3159.9107 3162.1863 3178.8821 3771.1256
redmass: 2.3882 1.3644 1.6315 1.1208 1.5351 1.3136 2.2720 1.8474 2.4318 1.9641 2.4280 1.9901 2.1948 3.1933 2.9328 4.5528 2.8461 3.6304 5.4882 2.2078 1.9212 2.1785 1.3876 2.1606 1.9593 2.1419 1.7605 2.4234 1.5172 1.8566 1.3911 1.4396 1.7638 1.9487 1.7049 1.8343 1.2945 2.1536 1.6604 1.8143 1.1825 1.5648 1.7449 1.8127 1.2137 1.4627 1.6146 1.5991 1.6971 1.5858 1.6653 1.3500 1.4159 1.4582 1.3543 1.0672 1.0502 1.0770 1.0787 1.0548 1.0780 1.0881 1.0767 1.0782 1.0819 1.0428 1.0382 1.0618 1.0385 1.0619 1.0779 1.0653 1.0725 1.0976 1.1036 1.1031 1.1001 1.1017 1.1039 1.1017 1.1021 1.1032 1.1016 1.0676
irintensity: 0.9305 0.1319 0.1225 0.3110 0.2886 0.6827 0.0684 0.4857 1.2349 1.0831 0.4000 18.3120 8.7603 0.4689 0.8668 11.0083 21.0359 32.9831 136.3464 46.8535 4.1681 7.4660 8.2343 20.3891 6.9068 1.6639 0.8196 1.4127 0.2402 2.8084 1.0566 3.5773 8.6387 22.4164 14.8533 0.4193 5.4996 12.8573 4.2303 11.3001 22.0991 19.8808 10.7114 23.0742 3.8316 3.3428 18.5565 9.6552 5.2839 13.7669 31.4128 27.5873 6.0793 37.3280 10.3901 0.7558 1.0474 2.5030 9.4889 3.9731 17.3395 4.3997 16.2027 23.5590 5.2735 0.9222 2.8065 12.9715 0.9454 9.3070 3.7758 9.5994 10.9467 0.2459 0.0699 4.9131 3.6849 8.8522 11.7213 5.9919 6.8757 3.2118 6.3373 99.2408
temp: 298.150 k
press: 1.00000 atm
elementType: 6 1 6 1 1 6 6 1 1 6 1 1 6 6 1 6 1 1 1 6 1 1 1 6 1 1 1 8 1 1
symmnumber: 1
zpe: 732007.5 jmol-1
zpe.correction: 0.278807 hartree
zpe.thermalcorrener: 0.290033 hartree
zpe.thermalcorrenthalpy: 0.290977 hartree
zpe.thermalcorrgfe: 0.243339 hartree
zpe.sumelectzpe: -467.225031 hartree
zpe.sumelectthermal: -467.213806 hartree
zpe.sumelectthermalent: -467.212861 hartree
zpe.sumelectthermalfe: -467.260499 hartree
dipole: -1.3133 -1.0912 0.4197
dipole: 1.7583
quadrupole: -54.0554 -54.3004 -58.5147
quadrupole: -1.5876 2.7114 -3.8256
quadrupole: 1.5681 1.3231 -2.8912 -1.5876 2.7114 -3.8256
hfenergy: -467.5038381 hartree
pointgroup: C01 [X(C10H19O1)]
dipole: -0.5139141 -0.4213749 0.1553738 debye
polarizability: 106.9111359|-4.8812069|105.4488897|3.7649579|-4.4291535|103.1112013 unknown
InChI: InChI=1/C10H19O/c1-9(2)8-4-6-10(3,11-9)7-5-8/h8,11H,4-7H2,1-3H3
charge 1 multiplicity 1
30 atoms
C  1.14830699 0.37452237 0.72846362
H  2.05703185 0.30729968 1.33207578
C  1.45480696 1.06115632 -0.60754694
H  1.7919913 2.07662679 -0.39564593
H  2.27510203 0.57416947 -1.13344567
C  0.66197779 -1.06306336 0.51436083
C  0.09813395 1.22319461 1.45527416
H  -0.09515532 0.85565532 2.46276737
H  0.5033393 2.22845777 1.57662642
C  -1.20395067 1.26332303 0.62645416
H  -2.0393158 0.80051273 1.16053618
H  -1.51528865 2.2901224 0.4221833
C  -1.01978973 0.57119635 -0.71205133
C  0.18268541 1.08256784 -1.48164411
H  0.30194908 0.48091493 -2.38478487
C  -2.27468056 0.43747522 -1.53465661
H  -2.59989153 1.43369681 -1.83911922
H  -2.09935512 -0.15231439 -2.43478904
H  -3.0928931 -0.00759485 -0.96217488
C  0.19648696 -1.77240596 1.76758857
H  -0.19033065 -2.76735295 1.53320875
H  1.05377195 -1.91305976 2.42854593
H  -0.5575476 -1.2131268 2.32174342
C  1.5793154 -1.93441454 -0.31174684
H  2.52635591 -2.05077177 0.21970343
H  1.14965181 -2.926894 -0.45202381
H  1.78753466 -1.50682549 -1.29029763
O  -0.61323911 -0.88482846 -0.37395365
H  -1.36317537 -1.35218374 0.02095691
H  -0.05564815 2.09535443 -1.81283629
