program: Gaussian 16
title: Title Card Required
version: ES64L-G16RevC.01
method: RmPW1PW91
basis: 6-31G(d,p)
operation: Freq
keyword: #N
keyword: Geom=AllCheck
keyword: Guess=TCheck
keyword: SCRF=Check
keyword: GenChk
keyword: RmPW1PW91/6-31G(d,p)
keyword: Freq
converged: YES YES YES YES
title: Mulliken charges:
elementType: C H C H H C C H H C H H C C H C H H H O H H C H H H C H H H
charge: -0.141780 0.174633 -0.269521 0.174792 0.178574 0.212047 -0.269360 0.178490 0.174881 -0.332296 0.259249 0.202511 0.254572 -0.332291 0.202481 -0.473525 0.241220 0.215444 0.215414 -0.588156 0.258958 0.343912 -0.396511 0.151322 0.160436 0.144687 -0.396602 0.160426 0.151390 0.144603
chargesum: 1.00000
title: Mulliken charges with hydrogens summed into heavy atoms:
elementType: C C C C C C C C O C C
charge: 0.032854 0.083845 0.212047 0.084011 0.129464 0.254572 0.129148 0.198553 -0.244244 0.059934 0.059817
1716.lowfreq: -16.1157 -10.0089 -6.3777 -0.0010 -0.0009 -0.0009 28.6848 82.6886 133.8125
frequency: 28.6546 82.6845 133.8122 187.1243 210.4899 212.6701 240.2804 293.9545 307.2969 320.6003 346.2381 367.0322 387.5136 401.7829 415.0075 416.2976 466.6916 504.0112 580.5300 615.3586 659.8592 723.6563 780.1058 848.7242 857.6147 882.4295 917.4909 939.1369 944.1633 964.4578 973.9127 1010.4838 1019.8561 1056.1863 1068.2247 1072.2578 1134.6198 1142.5237 1175.6139 1199.6745 1209.2658 1239.5521 1242.7974 1296.0917 1302.4025 1328.9226 1335.0531 1356.1248 1367.8624 1369.3559 1374.5015 1397.7649 1409.4003 1413.0541 1421.3700 1439.3278 1467.0222 1476.4419 1492.0359 1494.9338 1508.2386 1513.3607 1517.6645 1519.0580 1539.0768 2884.6904 2913.3144 3017.6554 3077.4790 3081.6437 3093.0073 3097.7175 3106.0962 3131.8607 3133.5672 3135.8697 3155.4373 3161.2625 3168.8983 3169.7951 3177.2723 3178.5577 3201.0754 3869.9061
redmass: 2.9935 3.0919 1.6273 1.1278 1.1224 2.9756 1.2368 1.9618 2.8847 1.8945 1.3475 2.2618 2.2091 1.8514 2.2513 1.6333 2.4998 2.7443 3.0321 2.9100 2.1761 2.0519 3.0835 2.5036 1.5209 1.7794 1.9161 1.4351 2.1558 2.1385 2.5703 1.3867 1.3191 2.0103 1.7203 1.3043 1.5167 1.6104 1.5351 1.5568 2.1392 2.0598 1.7126 1.5067 1.2148 1.4269 1.6363 1.1661 1.2167 1.3383 1.4330 1.2798 1.6487 1.3133 1.3095 1.2366 1.7261 1.6198 1.0545 1.1349 1.1664 1.2830 1.0840 1.0933 1.0717 1.0673 1.0696 1.0551 1.0372 1.0383 1.0791 1.0693 1.0749 1.0770 1.0870 1.0866 1.1021 1.1011 1.0991 1.0990 1.1000 1.1009 1.1086 1.0664
irintensity: 0.3168 1.0552 0.2389 0.1795 0.2444 13.9362 0.5125 10.1377 6.7343 7.5951 72.3729 0.7798 20.9794 5.4648 2.2397 37.2336 3.6436 5.7216 3.3996 13.0485 17.5548 1.8923 4.0402 15.7265 5.4645 26.6107 0.8210 0.6640 64.3735 7.4813 0.8330 0.8552 0.1111 60.2261 2.7377 5.9018 3.6105 63.4350 0.0418 11.3668 33.2186 0.9817 4.9824 10.5362 55.0770 22.8642 26.2415 33.6148 38.9384 11.1947 60.1861 11.4228 24.1221 30.8585 14.2103 16.4242 3.3030 29.1681 1.2662 3.5785 12.6102 34.5641 24.9872 14.0183 1.2040 42.2133 193.4239 40.7249 8.5248 4.1376 4.9803 5.3848 14.4273 2.9264 0.5969 3.0595 2.0982 24.8466 0.4928 8.0982 20.3784 9.7740 0.5292 48.8663
temp: 298.150 k
press: 1.00000 atm
elementType: 6 1 6 1 1 6 6 1 1 6 1 1 6 6 1 6 1 1 1 8 1 1 6 1 1 1 6 1 1 1
symmnumber: 1
zpe: 721795.6 jmol-1
zpe.correction: 0.274917 hartree
zpe.thermalcorrener: 0.287355 hartree
zpe.thermalcorrenthalpy: 0.288299 hartree
zpe.thermalcorrgfe: 0.237295 hartree
zpe.sumelectzpe: -467.116100 hartree
zpe.sumelectthermal: -467.103663 hartree
zpe.sumelectthermalent: -467.102719 hartree
zpe.sumelectthermalfe: -467.153722 hartree
dipole: -3.7694 2.7443 -0.3963
dipole: 4.6794
quadrupole: -46.5925 -48.4251 -58.2267
quadrupole: -11.4546 3.0894 -2.9276
quadrupole: 4.4890 2.6563 -7.1453 -11.4546 3.0894 -2.9276
hfenergy: -467.3910175 hartree
pointgroup: C01[X(C10H19O1)]
dipole: -1.4923659 1.0950478 -0.1432211 debye
polarizability: 111.8070122|-15.1692037|107.8592333|6.6507906|1.6115016|95.9560491 unknown
InChI: InChI=1/C10H19O/c1-8-4-6-9(7-5-8)10(2,3)11/h9,11H,4-7H2,1-3H3
charge 1 multiplicity 1
30 atoms
C  1.069429 0.00073442 -0.54029169
H  2.05709105 -0.01826741 -1.01353179
C  0.03262354 -0.08150601 -1.66916303
H  0.27806804 0.66337843 -2.43258361
H  0.05581038 -1.04766275 -2.17306618
C  1.06198056 -1.20685198 0.43493964
C  0.92572839 1.37070838 0.13686232
H  1.61191124 1.48327813 0.97613318
H  1.19494389 2.15225405 -0.58050166
C  -0.4997421 1.64703416 0.63444468
H  -0.71295513 0.90318778 1.43890134
H  -0.64189713 2.63506163 1.07999114
C  -1.57895944 1.29513773 -0.27195755
C  -1.40075147 0.1806467 -1.18675337
H  -2.15479744 0.17331806 -1.97814888
C  -2.86330392 1.99545775 -0.20038637
H  -2.76586252 2.82780976 -0.91984867
H  -3.70384167 1.38864953 -0.54083239
H  -3.05258042 2.44873229 0.77394459
O  -0.23088246 -1.19878106 1.07292171
H  -1.66624426 -0.64883776 -0.48888028
H  -0.26981285 -1.93872631 1.68878646
C  2.14997413 -1.06956802 1.4992716
H  2.1695068 -1.96123542 2.13195858
H  3.13933666 -0.97246359 1.0457955
H  1.98037381 -0.21100241 2.15108505
C  1.24693962 -2.52720581 -0.31191766
H  2.1729537 -2.52943207 -0.89194034
H  1.30845483 -3.35476955 0.40016768
H  0.41433316 -2.73760765 -0.98515799
