program: Gaussian 16
title: Title Card Required
version: ES64L-G16RevC.01
method: RmPW1PW91
basis: 6-31+G(d,p)
operation: Freq
keyword: #N
keyword: Geom=AllCheck
keyword: Guess=TCheck
keyword: SCRF=Check
keyword: GenChk
keyword: RmPW1PW91/6-31+G(d,p)
keyword: Freq
converged: YES YES YES YES
title: Mulliken charges:
elementType: O H H
charge: -0.724547 0.362274 0.362274
chargesum: 0.00000
title: Mulliken charges with hydrogens summed into heavy atoms:
elementType: O
charge: 0.000000
1716.lowfreq: -13.1395 -0.0025 -0.0021 -0.0018 9.2677 16.2729 1618.0927 3881.3974 4007.2715
frequency: 1618.0927 3881.3974 4007.2715
redmass: 1.0835 1.0444 1.0831
irintensity: 94.4965 9.4787 65.0967
temp: 298.150 k
press: 1.00000 atm
elementType: 8 1 1
symmnumber: 1
zpe: 56863.1 jmol-1
zpe.correction: 0.021658 hartree
zpe.thermalcorrener: 0.024494 hartree
zpe.thermalcorrenthalpy: 0.025438 hartree
zpe.thermalcorrgfe: 0.003369 hartree
zpe.sumelectzpe: -76.389753 hartree
zpe.sumelectthermal: -76.386917 hartree
zpe.sumelectthermalent: -76.385973 hartree
zpe.sumelectthermalfe: -76.408042 hartree
dipole: 1.2717 1.7994 0.0000
dipole: 2.2034
quadrupole: -12.4651 -1.9675 -7.7827
quadrupole: -4.9555 -0.0000 0.0000
quadrupole: -5.0600 5.4376 -0.3776 -4.9555 -0.0000 0.0000
hfenergy: -76.4114108 hartree
pointgroup: CS [SG(H2O1)]
dipole: 0.5003177 0.7079335 0. debye
dipolederiv: -0.5043758 0.0622845 0. 0.0622861 -0.4602557 0. 0. 0. -0.7916232 0.1755712 -0.0475087 0. -0.069041 0.3067479 0. 0. 0. 0.3958134 0.3288046 -0.0147758 0. 0.0067549 0.1535078 0. 0. 0. 0.3958098 unknown
polarizability: 7.1857355|-0.5988049|6.7616313|0.|0.|6.3491362 unknown
InChI: InChI=1/H2O/h1H2
charge 0 multiplicity 1
3 atoms
O  -2.9972029 0.95051934 0.0000
H  -2.03748132 0.98184735 0.0000
H  -3.28803377 1.86565031 0.0000
