program: Gaussian 16
title: Title Card Required
version: ES64L-G16RevC.01
method: RmPW1PW91
basis: 6-31+G(d,p)
operation: Freq
keyword: #N
keyword: Geom=AllCheck
keyword: Guess=TCheck
keyword: SCRF=Check
keyword: GenChk
keyword: RmPW1PW91/6-31+G(d,p)
keyword: Freq
converged: YES YES NO YES
title: Mulliken charges:
elementType: C H C H H C C H H C H H C C H C H H H O H H C H H H C H H H
charge: 0.285221 0.204069 -0.513191 0.225606 0.185365 -0.258882 -0.599328 0.188797 0.205619 -0.162012 0.174495 0.215690 0.117069 -0.288852 0.198323 -0.511363 0.212159 0.195116 0.186121 -0.354919 0.349401 0.436281 -0.529352 0.206326 0.231005 0.199392 -0.404696 0.212914 0.200343 0.193284
chargesum: 1.00000
title: Mulliken charges with hydrogens summed into heavy atoms:
elementType: C C C C C C C C O C C
charge: 0.489290 -0.102220 -0.258882 -0.204913 0.228174 0.117069 -0.090529 0.082034 0.430763 0.107370 0.201845
1716.lowfreq: -9.2711 -0.0003 0.0007 0.0010 4.5790 8.4646 78.3143 113.1753 157.7505
frequency: 78.3126 113.1747 157.7493 183.9614 222.7452 255.1485 284.5425 301.4065 309.9776 323.4180 350.9403 368.4509 391.6115 404.8757 441.1006 450.7983 474.8778 533.0737 582.7991 605.7436 693.7893 774.0684 801.9938 831.3928 868.9252 880.1983 917.1875 941.2580 960.3055 968.3175 982.7975 1016.7978 1028.7285 1035.7558 1069.0115 1096.7293 1117.7370 1126.0557 1146.6927 1193.5189 1204.5133 1213.3073 1251.1275 1265.0731 1306.2002 1330.6332 1353.9242 1367.1901 1390.5703 1402.0345 1416.9414 1423.4078 1428.6805 1438.8796 1476.1587 1480.8181 1484.6764 1485.7362 1493.3853 1495.8668 1504.4856 1513.6479 1524.7756 1615.4163 1709.3267 2542.6303 3032.5979 3066.2206 3080.2475 3081.0357 3090.0089 3093.3302 3098.5393 3106.0753 3127.1757 3132.6890 3145.1259 3164.6446 3175.9016 3176.3444 3178.5821 3193.7291 3198.0727 3808.1722
redmass: 2.9524 2.9305 1.5082 1.4454 1.0490 1.4831 2.3708 2.5147 1.7583 2.7064 2.2763 1.9103 1.7071 1.9477 2.3444 2.4175 2.0912 3.4095 4.0010 4.7859 2.6089 2.4795 2.0108 1.2398 1.8648 1.6964 1.8934 1.4285 2.5697 1.8768 1.5026 1.3281 1.4524 1.7332 1.6637 1.7713 1.5652 1.6414 1.2796 2.1849 1.2690 1.5138 1.4466 1.6615 1.6414 1.4009 1.4885 1.5949 1.8608 1.4388 1.7296 1.3328 1.3876 1.2243 1.0746 1.0656 1.0535 1.0638 1.0788 1.0620 1.0641 1.0859 1.0686 1.1100 5.3375 1.0881 1.0721 1.0385 1.0464 1.0577 1.0687 1.0480 1.0772 1.0810 1.0984 1.0999 1.1024 1.1024 1.1025 1.1029 1.1023 1.1031 1.0907 1.0672
irintensity: 2.5122 2.1404 1.0076 2.8333 0.0922 1.3247 7.5806 13.7055 6.8984 14.4083 10.2778 4.8471 28.4794 39.6614 4.7634 10.4017 33.1656 14.1603 1.7735 48.4264 14.6503 1.3355 16.7103 13.2904 29.9667 23.0367 17.0364 1.9750 1.8018 6.9253 23.2105 1.4866 2.9679 0.4448 26.2404 12.2533 12.0010 17.8621 14.8356 5.7428 3.7133 8.4024 30.1734 0.5115 14.1270 4.8574 1.0340 17.8524 2.3937 5.1017 2.7410 27.0789 10.2611 21.6689 9.9563 0.9206 14.3807 1.3850 2.6675 42.8212 29.7200 4.8183 0.6294 78.8979 31.6074 1878.7510 21.8910 6.2712 0.7542 7.2304 2.1188 4.5136 10.6974 6.4388 9.8829 4.3085 13.8646 3.0826 6.0914 7.7703 2.7647 5.1094 3.4828 159.7148
temp: 298.150 k
press: 1.00000 atm
elementType: 6 1 6 1 1 6 6 1 1 6 1 1 6 6 1 6 1 1 1 8 1 1 6 1 1 1 6 1 1 1
symmnumber: 1
zpe: 725857.3 jmol-1
zpe.correction: 0.276464 hartree
zpe.thermalcorrener: 0.288406 hartree
zpe.thermalcorrenthalpy: 0.289351 hartree
zpe.thermalcorrgfe: 0.240333 hartree
zpe.sumelectzpe: -467.122345 hartree
zpe.sumelectthermal: -467.110403 hartree
zpe.sumelectthermalent: -467.109459 hartree
zpe.sumelectthermalfe: -467.158477 hartree
dipole: 0.3157 -1.5179 2.0304
dipole: 2.5546
quadrupole: -53.2328 -55.1496 -56.5595
quadrupole: -5.8936 0.0025 -2.8107
quadrupole: 1.7478 -0.1690 -1.5788 -5.8936 0.0025 -2.8107
hfenergy: -467.3988096 hartree
pointgroup: C01 [X(C10H19O1)]
dipole: 0.1038797 -0.5958412 0.7718367 debye
polarizability: 113.4876651|-13.5346518|113.8668436|0.857261|5.5007361|107.1458472 unknown
InChI: InChI=1/C10H19O/c1-8-4-6-9(7-5-8)10(2,3)11/h4,9H,5-7,11H2,1-3H3
charge 1 multiplicity 1
30 atoms
C  1.10788707 -0.00398525 -0.63140427
H  2.08672563 -0.13004657 -1.10752437
C  0.02550789 -0.10449812 -1.72036361
H  0.32865277 0.50283765 -2.58092026
H  -0.07072614 -1.12268201 -2.10762467
C  1.04743395 -1.1713342 0.37607947
C  1.05662522 1.4110788 -0.03592996
H  1.85413748 1.5688114 0.69370611
H  1.268995 2.09946821 -0.85949563
C  -0.2997637 1.77895249 0.57134456
H  -0.37856142 1.45339621 1.61942739
H  -0.39434917 2.86916371 0.62529778
C  -1.48239387 1.24098687 -0.19408918
C  -1.31620568 0.37917272 -1.22336226
H  -2.19389852 0.04948968 -1.77519009
C  -2.83474936 1.73107339 0.22638433
H  -2.91994114 2.80196776 0.01426758
H  -3.64106868 1.21761858 -0.29921092
H  -2.98791923 1.61655338 1.3043332
O  -0.4718562 -1.36317977 0.71352901
H  -1.0470849 -0.63876714 0.24676231
H  -0.64691509 -1.39266864 1.66646936
C  1.73434274 -0.91643508 1.70041125
H  1.66639433 -1.79056152 2.3539955
H  2.79672445 -0.7389339 1.5164839
H  1.34231603 -0.04081814 2.22143006
C  1.45056462 -2.50447798 -0.2193861
H  2.51928498 -2.4787574 -0.44523241
H  1.27805452 -3.31672707 0.4890251
H  0.91356839 -2.72885607 -1.14090416
