program: Gaussian 09
title: 000077350
version: EM64L-G09RevD.01
frameworkgroup: C1[X(C13H12N2O3)]
method: RPBEPBE
basis: SDD
operation: Freq
keyword: #p
keyword: freq=noraman
keyword: PBEPBE/SDD
title: #p freq=noraman PBEPBE/SDD
converged: NO YES NO NO
title: Mulliken charges:
elementType: O O O N N C C C C C C C C C C C C C H H H H H H H H H H H H
charge: -0.444427 -0.444371 -0.280656 -0.509306 -0.509233 0.519462 0.519379 -0.588644 -0.588619 0.276980 -0.368412 -0.368310 0.348288 0.348309 -0.170159 -0.170340 -0.428430 -0.428369 0.293189 0.293234 0.240712 0.240713 0.307542 0.307624 0.224700 0.224724 0.221560 0.221511 0.355662 0.355686
chargesum: 0.00000
title: Mulliken charges with hydrogens summed into heavy atoms:
elementType: O O O N N C C C C C C C C C C C C C
charge: -0.088765 -0.088684 -0.280656 -0.216117 -0.215999 0.519462 0.519379 -0.347932 -0.347906 0.276980 -0.060870 -0.060686 0.348288 0.348309 0.054540 0.054384 -0.206870 -0.206858
polarizability: 3.13784055e+02 4.82279396e-05 1.69122428e+02 1.49045595e-02 1.39742911e-03 6.53237149e+01
1716.lowfreq: -0.0010 -0.0007 0.0008 4.7107 9.7487 16.3606 27.6828 36.4092 66.9190
frequency: 27.4923 35.2274 66.9190 72.0476 76.8712 178.0947 202.6369 223.3180 224.6751 227.0491 232.3742 296.5247 318.9040 354.5747 355.0956 418.3533 433.4503 440.0168 452.2997 467.7458 502.8677 516.4693 536.5052 588.1866 611.0008 631.7729 641.1376 685.5521 688.0153 698.2912 711.0720 772.9356 774.2482 775.4458 799.3601 857.9753 859.7402 882.4334 884.4409 918.5026 932.8578 978.8986 979.5654 980.0792 981.6980 1036.0982 1089.4721 1089.9783 1139.0232 1143.4703 1162.6450 1175.2055 1177.4391 1212.0644 1214.7403 1279.2147 1285.4981 1312.0327 1319.0779 1382.9393 1389.3585 1441.0405 1451.4277 1480.7017 1489.3054 1524.3857 1533.4400 1601.2075 1605.7653 1635.3045 1635.3502 1658.6229 3122.2700 3122.4686 3136.6510 3136.7379 3150.8624 3150.9760 3207.1662 3207.5720 3521.6577 3534.2210 3586.6375 3586.7451
redmass: 4.8731 5.6832 6.2157 8.3002 4.4543 5.8666 7.5523 3.0360 4.9123 3.8087 4.0212 6.4954 10.8935 1.1023 1.1028 4.1656 1.7696 3.9315 2.9541 2.2233 7.1193 7.2706 7.8628 2.0767 4.3760 1.7118 6.9191 2.0351 2.1034 10.0413 7.2372 1.3839 1.3920 6.7565 7.3783 1.7382 1.7195 1.3956 1.3984 4.9777 3.7474 1.2966 5.9835 1.2936 6.2438 3.1393 1.6100 1.6024 1.4123 1.3789 1.8398 1.0828 1.2169 1.4785 1.6414 2.7023 1.7747 1.6034 2.2627 4.5769 6.9786 2.5370 2.5662 2.8118 2.9032 2.2674 2.3768 5.2908 5.5517 5.9353 5.8020 4.2086 1.0884 1.0883 1.0920 1.0920 1.0952 1.0952 1.0946 1.0946 1.0767 1.0756 1.0660 1.0660
irintensity: 0.0000 0.6306 0.3301 9.9538 0.0072 16.1500 0.7782 0.0007 9.2565 0.0015 6.3690 3.5707 2.7414 0.4130 289.5631 9.7077 0.0000 7.4080 10.0398 0.0001 2.9593 2.6158 16.3058 32.5443 0.0001 118.8462 0.1122 0.0030 74.5466 12.3763 4.8734 0.1340 104.1521 0.0241 13.0775 0.0001 101.3753 0.0545 31.6391 12.1226 104.4090 0.0109 2.6810 10.3332 3.1042 19.5993 46.6903 7.5112 303.6474 156.9666 269.2799 0.7157 128.5144 163.6367 11.0169 12.4488 83.0769 207.7233 0.1027 2.3422 401.2687 6.4277 138.9040 554.1811 20.6553 643.0055 10.2502 109.6464 167.4599 214.6823 148.6932 75.5915 12.9877 11.3318 7.1483 12.2547 16.0547 18.2573 15.7088 3.7585 6.0940 15.5651 60.8074 25.5192
temp: 298.150 k
press: 1.00000 atm
elementType: 8 8 8 7 7 6 6 6 6 6 6 6 6 6 6 6 6 6 1 1 1 1 1 1 1 1 1 1 1 1
symmnumber: 1
zpe: 599457.7 jmol-1
zpe.correction: 0.228321 hartree
zpe.thermalcorrener: 0.244241 hartree
zpe.thermalcorrenthalpy: 0.245185 hartree
zpe.thermalcorrgfe: 0.183904 hartree
zpe.sumelectzpe: -836.497481 hartree
zpe.sumelectthermal: -836.481561 hartree
zpe.sumelectthermalent: -836.480617 hartree
zpe.sumelectthermalfe: -836.541898 hartree
dipole: 0.0016 -1.5551 0.0003
dipole: 1.5551
quadrupole: -64.5975 -102.9290 -112.4101
quadrupole: -0.0039 0.0033 0.0005
quadrupole: 28.7147 -9.6168 -19.0979 -0.0039 0.0033 0.0005
hfenergy: -836.725802 hartree
pointgroup: C01 [X(C13H12N2O3)]
dipole: -0.00063 -0.6118187 -0.0000995 debye
polarizability: 313.7840547|-0.0040405|169.1224283|0.0149045|-0.0013978|65.3237149 unknown
InChI: InChI=1S/C13H12N2O3/c16-11-5-1-3-9(7-11)14-13(18)15-10-4-2-6-12(17)8-10/h1-8,14-17H
charge 0 multiplicity 1
30 atoms
O  5.798246 -1.805228 0.0004
O  -5.796856 -1.804543 -0.000338
O  0.000405 1.528064 0.000111
N  1.166184 -0.525266 -0.000005
N  -1.164422 -0.525445 -0.000083
C  2.518874 -0.084002 0.000048
C  -2.517147 -0.084139 -0.000108
C  3.51417 -1.096072 0.000181
C  -3.51261 -1.096135 -0.000176
C  0.00066 0.264451 0.000057
C  2.897888 1.286738 0.000052
C  -2.895752 1.286649 -0.000182
C  4.876709 -0.74114 0.00028
C  -4.875072 -0.740881 -0.000284
C  4.270324 1.610629 0.000152
C  -4.26814 1.610904 -0.00028
C  5.273992 0.617809 0.000245
C  -5.271887 0.618242 -0.000317
H  1.053339 -1.541083 -0.000061
H  -1.051716 -1.54129 -0.000155
H  3.251705 -2.160456 0.000229
H  -3.250326 -2.160573 -0.000145
H  2.129194 2.059403 -0.000002
H  -2.126737 2.059042 -0.000152
H  4.56358 2.666272 0.000152
H  -4.561172 2.666593 -0.000333
H  6.336095 0.892744 0.000317
H  -6.33397 0.893366 -0.000401
H  6.72608 -1.462527 0.000475
H  -6.724637 -1.461725 -0.000379
