program: Gaussian 09
title: 000077338
version: EM64L-G09RevD.01
frameworkgroup: C1[X(C10H6Cl2N2)]
method: RPBEPBE
basis: SDD
operation: Freq
keyword: #p
keyword: freq=noraman
keyword: PBEPBE/SDD
title: #p freq=noraman PBEPBE/SDD
converged: NO YES NO YES
title: Mulliken charges:
elementType: Cl Cl N N C C C C C C C C C C H H H H H H
charge: -0.005166 -0.005166 0.046881 0.046880 0.322568 -0.121787 -0.342054 -0.342055 -0.223110 -0.223109 -0.223879 -0.193479 -0.193479 -0.088679 0.278463 0.278462 0.233650 0.233650 0.234224 0.287185
chargesum: 0.00000
title: Mulliken charges with hydrogens summed into heavy atoms:
elementType: Cl Cl N N C C C C C C C C C C
charge: -0.005166 -0.005166 0.046881 0.046880 0.322568 -0.121787 -0.063592 -0.063593 0.010540 0.010541 0.010345 -0.193479 -0.193479 0.198506
polarizability: 2.34546085e+02 1.85383856e-06 1.67896839e+02 -1.57063547e-03 1.02354583e-02 5.05492283e+01
1716.lowfreq: -9.6145 -6.4633 -0.0022 -0.0017 -0.0008 7.1966 46.8422 76.6275 98.0782
frequency: 46.8410 76.6272 98.0777 131.5041 171.8731 196.3315 222.0597 283.3135 299.0705 391.2774 399.4836 404.0620 454.2511 516.1557 578.5705 613.9155 630.7020 637.2391 700.0948 754.3787 765.6649 789.9156 814.9101 845.0359 865.5303 923.5457 960.5344 989.4938 1001.0989 1011.9623 1021.2647 1064.1431 1082.5817 1088.6230 1174.3018 1184.6114 1218.7392 1240.9307 1304.1922 1324.7126 1385.9897 1393.0810 1438.6274 1465.7749 1491.1651 1528.3350 1586.6791 1612.4796 3131.9431 3145.2542 3158.4813 3170.3622 3176.8610 3215.0802
redmass: 4.1704 6.9382 7.7370 6.3233 18.3572 14.3053 5.0736 6.8086 11.2907 12.8166 10.8791 2.8531 3.5590 7.4145 12.4028 6.4562 4.2995 7.6215 1.8160 2.4344 13.1059 8.4846 2.8846 1.4944 1.2446 9.2494 1.4284 6.2558 1.3793 1.3360 2.5128 1.8261 3.8423 1.5054 1.0559 1.1260 8.7636 5.3724 2.2417 1.7024 4.0846 9.4355 2.4423 5.7445 2.9123 10.9382 6.2893 6.1517 1.0857 1.0894 1.0940 1.0952 1.0997 1.0962
irintensity: 0.0000 1.5729 0.5028 4.1964 0.8047 0.0000 0.9575 1.4183 2.8515 8.3776 11.6246 0.0000 1.4506 0.0500 0.0005 0.0440 11.4987 41.5603 56.3897 36.9596 129.1386 42.3962 19.9213 22.6846 0.0001 5.8300 5.0817 2.9112 0.0000 0.7393 3.6626 13.7379 62.9694 37.4761 0.1130 22.7586 165.4812 3.7045 23.2159 13.1510 242.9089 17.8517 12.0022 374.6142 42.0548 656.2865 0.0262 9.0823 0.0790 13.0962 19.4402 8.0704 19.7576 6.0450
temp: 298.150 k
press: 1.00000 atm
elementType: 17 17 7 7 6 6 6 6 6 6 6 6 6 6 1 1 1 1 1 1
symmnumber: 1
zpe: 353961.5 jmol-1
zpe.correction: 0.134817 hartree
zpe.thermalcorrener: 0.146289 hartree
zpe.thermalcorrenthalpy: 0.147233 hartree
zpe.thermalcorrgfe: 0.095618 hartree
zpe.sumelectzpe: -1413.321052 hartree
zpe.sumelectthermal: -1413.309580 hartree
zpe.sumelectthermalent: -1413.308635 hartree
zpe.sumelectthermalfe: -1413.360250 hartree
dipole: -1.3397 0.0000 0.0002
dipole: 1.3397
quadrupole: -77.3496 -97.3436 -97.0865
quadrupole: 0.0000 -0.0008 0.0031
quadrupole: 13.2436 -6.7504 -6.4933 0.0000 -0.0008 0.0031
hfenergy: -1413.4558687 hartree
pointgroup: C01 [X(C10H6Cl2N2)]
dipole: -0.5270681 0.0000037 0.000058 debye
dipolederiv: -0.3980622 -0.3549948 -0.0636944 -0.4873432 -0.7453631 -0.1211545 -0.0880769 -0.1217446 -0.0920017 -0.3980315 0.3549859 0.0636699 0.4873334 -0.7453967 -0.1211199 0.0880506 -0.1217539 -0.0919957 -1.56595 -0.4014585 -0.0724122 -0.499508 -0.5561839 -0.0758056 -0.0890599 -0.0761968 -0.146064 -1.5659102 0.4015097 0.072315 0.4995943 -0.5562361 -0.0758501 0.0887772 -0.0760438 -0.146044 -0.7755926 0.000014 0.0000013 -0.000006 -0.0454674 -0.0052811 0.0001163 -0.0051584 -0.0174386 2.1456327 -0.0000351 0.0000318 -0.0000145 0.518481 0.076454 -0.0000883 0.0767354 0.1055204 0.1345696 0.1201881 0.0215299 -0.2111827 -0.0083433 0.0194482 -0.0375163 0.0194749 -0.112965 0.1345752 -0.1201843 -0.0215817 0.2111672 -0.0083483 0.0194379 0.0375696 0.0195005 -0.1129622 -0.1862315 -0.1816294 -0.0324651 -0.2688135 0.0509333 0.0363785 -0.0479578 0.0362954 -0.1461507 -0.1862143 0.1816413 0.0324513 0.2688282 0.0509287 0.0363507 0.0479367 0.0362499 -0.1461635 0.1173682 0.000003 -0.0000268 0.0000005 0.0409963 0.0314825 -0.0000164 0.0315168 -0.1290741 1.4160878 0.4649723 0.0840189 0.6853288 1.4193829 0.2468698 0.1232888 0.24743 0.085381 1.4160408 -0.4649994 -0.0838613 -0.6853733 1.4194449 0.2468343 -0.1230274 0.2473443 0.0853569 -0.4644618 -0.0000043 -0.0000192 0.0000026 -0.9853685 -0.1686986 -0.0000609 -0.1682232 -0.0727339 0.1241228 -0.0680002 -0.0121996 -0.0612782 0.01988 -0.0238604 -0.011075 -0.0238574 0.1487373 0.1241265 0.0679925 0.012219 0.0612698 0.0198777 -0.0238679 0.0110961 -0.0238693 0.1487339 0.0088606 0.0785739 0.0140417 0.1101638 -0.0534628 -0.0379529 0.0196225 -0.0379371 0.1519238 0.0088532 -0.0785792 -0.0140267 -0.1101681 -0.0534624 -0.0379373 -0.0196175 -0.0379156 0.1519303 -0.134705 0.0000007 0.0000234 -0.0000011 0.0977424 -0.0107307 0.0000334 -0.0107206 0.1557908 0.0449216 0.0000039 -0.0000153 -0.0000003 0.1199653 -0.0109969 0.0000053 -0.0111266 0.1802189 unknown
polarizability: 234.5460852|-0.0013306|164.2488483|0.0001811|20.3660317|54.1972189 unknown
InChI: InChI=1S/C10H6Cl2N2/c11-8-6-9(12)14-10(13-8)7-4-2-1-3-5-7/h1-6H
charge 0 multiplicity 1
20 atoms
Cl 3.131788 2.736242 0.490288
Cl 3.131694 -2.736375 -0.489983
N  0.923281 1.191311 0.212973
N  0.923239 -1.191304 -0.213033
C  -1.21013 0.000052 -0.000076
C  0.266062 0.000052 -0.000234
C  -1.923657 1.210469 0.216798
C  -1.923707 -1.210365 -0.216787
C  -3.332547 1.206973 0.216168
C  -3.332597 -1.206855 -0.215906
C  -4.040773 0.000062 0.000196
C  2.259452 1.163496 0.20704
C  2.259413 -1.163591 -0.206772
C  3.033937 -0.000065 0.000159
H  -1.358014 2.132147 0.382019
H  -1.358103 -2.132046 -0.382128
H  -3.880014 2.140696 0.383105
H  -3.880101 -2.140574 -0.382749
H  -5.136501 0.000067 0.000296
H  4.123278 -0.000093 0.000226
