program: Gaussian 09
title: 000077307
version: EM64L-G09RevD.01
frameworkgroup: C1[X(C12H8O7)]
method: RPBEPBE
basis: SDD
operation: Freq
keyword: #pfreq=noraman
keyword: PBEPBE/SDD
title: #p freq=noraman PBEPBE/SDD
converged: NO YES NO NO
title: Mulliken charges:
elementType: O O O O O O O C C C C C C C C C C C C H H H H H H H H
charge: -0.411022 -0.355503 -0.433560 -0.560298 -0.103919 -0.174717 -0.333960 0.328087 0.229107 -0.095049 0.182668 -0.062652 -0.072277 0.354356 -0.160710 -0.562230 0.063540 0.241277 -0.733454 0.246206 0.261109 0.261154 0.251959 0.426539 0.403277 0.405409 0.404665
chargesum: 0.00000
title: Mulliken charges with hydrogens summed into heavy atoms:
elementType: O O O O O O O C C C C C C C C C C C C
charge: 0.015517 0.047774 -0.028151 -0.155634 -0.103919 -0.174717 -0.333960 0.328087 0.229107 -0.095049 0.182668 -0.062652 -0.072277 0.354356 -0.160710 -0.316024 0.063540 0.241277 0.040768
polarizability: 2.89484264e+02 4.08649301e+00 1.87573918e+02 1.12761532e-02 8.93803663e-03 6.39029170e+01
1716.lowfreq: -0.0006 -0.0003 0.0005 1.7650 6.4866 9.4822 36.5209 45.7590 87.4482
frequency: 36.5115 45.7083 87.4402 90.0237 159.4525 169.0135 176.2385 189.7375 194.6311 255.0468 297.8743 306.4522 343.4467 349.3224 370.4534 385.4858 391.2228 404.9994 416.8458 416.9616 443.5295 450.0807 475.7916 513.5179 538.2025 564.0173 582.8010 615.9811 617.3237 652.4057 692.5073 701.4666 728.0941 773.7861 788.0703 796.7120 825.1950 869.1175 884.6371 907.2969 987.1966 1030.2939 1061.3752 1073.5637 1121.8764 1148.2792 1163.6395 1177.8455 1220.3204 1232.4042 1268.7594 1305.8317 1328.4754 1356.4741 1378.2703 1387.4545 1405.9341 1431.7819 1434.8649 1450.5396 1523.9039 1545.8608 1549.3894 1564.3675 1594.5167 1615.2152 1630.0445 2167.2626 3005.0798 3088.2861 3130.7374 3134.5573 3144.7397 3385.1445 3607.8853
redmass: 12.4430 5.2585 6.8879 5.8231 10.3116 3.9034 1.4660 6.3274 3.5452 5.9923 6.5592 6.8525 5.5247 11.4583 5.3218 8.3941 4.0598 5.6509 6.2929 1.7700 6.7751 3.4093 12.1519 8.2030 4.4282 8.3955 4.5329 1.2038 4.6314 4.8424 4.7917 6.5007 6.9268 2.2377 1.3931 5.9651 2.4302 3.9789 6.3690 7.5669 1.9974 1.7603 3.6263 6.4052 1.0588 1.8460 2.5820 2.5339 3.5885 2.1489 3.6843 3.0479 3.2222 5.0479 2.1558 1.3723 2.8481 1.2892 1.0481 5.2734 2.9335 7.4182 3.8064 8.1277 3.8524 8.0003 5.9429 1.0802 1.0365 1.0944 1.0923 1.1025 1.0665 1.0636 1.0665
irintensity: 0.0630 0.8791 0.5771 4.8754 0.0116 0.2178 2.9600 3.0920 0.5871 16.4082 3.7008 12.6899 18.4599 3.6132 5.4540 6.8008 41.8262 0.8885 3.6935 91.7910 10.2520 19.2413 6.1663 20.6852 0.2152 13.7953 2.1180 129.8434 32.7096 3.0140 11.3535 7.2187 52.9039 111.6349 20.7857 1.9530 62.9490 17.4960 1.6269 93.2519 32.9589 10.1933 24.7896 29.3426 140.6664 33.9431 229.6826 3.1049 126.2770 164.2539 70.5413 85.9380 221.4090 402.0696 84.8247 110.4948 147.5079 31.3707 19.2699 85.0929 186.2908 136.5174 193.0943 205.6048 245.9970 429.7923 13.6062 689.6726 1.0255 2.3521 2.7226 28.6400 305.0012 123.4724 72.1939
temp: 298.150 k
press: 1.00000 atm
elementType: 8 8 8 8 8 8 8 6 6 6 6 6 6 6 6 6 6 6 6 1 1 1 1 1 1 1 1
symmnumber: 1
zpe: 473479.4 jmol-1
zpe.correction: 0.180339 hartree
zpe.thermalcorrener: 0.196434 hartree
zpe.thermalcorrenthalpy: 0.197378 hartree
zpe.thermalcorrgfe: 0.136970 hartree
zpe.sumelectzpe: -987.288544 hartree
zpe.sumelectthermal: -987.272449 hartree
zpe.sumelectthermalent: -987.271505 hartree
zpe.sumelectthermalfe: -987.331914 hartree
dipole: -4.9427 7.5727 0.0040
dipole: 9.0431
quadrupole: -136.9479 -94.7221 -107.5178
quadrupole: 16.7837 0.0102 0.0048
quadrupole: -23.8853 18.3405 5.5448 16.7837 0.0102 0.0048
hfenergy: -987.4688832 hartree
pointgroup: C01 [X(C12H8O7)]
dipole: 2.0514885 2.8276992 0.6734517 debye
polarizability: 286.7031946|-11.646103|185.1287241|20.9956757|18.6947329|69.1291811 unknown
InChI: InChI=1S/C12H8O7/c1-3(13)6-10(17)7-4(14)2-5(15)9(16)8(7)12(19)11(6)18/h2,14,17-19H,1H3
charge 0 multiplicity 1
27 atoms
O  1.45974 2.1523 0.599377
O  -0.308629 -3.073081 -0.442179
O  2.244225 -2.581193 -0.097023
O  -0.89755 2.982532 0.49285
O  -2.835286 -2.132459 -0.545807
O  -4.600258 0.031965 -0.373137
O  4.115105 -1.108987 0.335768
C  -0.428085 0.631272 0.154098
C  -0.90953 -0.712747 -0.11676
C  0.962666 0.888985 0.339642
C  1.925067 -0.178623 0.263193
C  0.029716 -1.762147 -0.192414
C  1.429456 -1.489907 -0.003019
C  -1.426189 1.693738 0.226449
C  -2.372557 -0.983966 -0.311779
C  -2.781259 1.526125 0.059257
C  -3.355947 0.217241 -0.216277
C  3.382209 -0.035682 0.435184
C  4.083009 1.2633 0.719475
H  -3.477138 2.371653 0.127131
H  3.701133 1.718599 1.649823
H  3.875344 2.002658 -0.073192
H  5.163791 1.072267 0.798266
H  0.689856 2.809665 0.628422
H  0.539256 -3.608305 -0.442174
H  3.250551 -2.192047 0.071085
H  -1.596796 3.678142 0.533941
