program: Gaussian 09
title: 000077282
version: EM64L-G09RevD.01
frameworkgroup: C1[X(C7H4N4)]
method: RPBEPBE
basis: SDD
operation: Freq
keyword: #p
keyword: freq=noraman
keyword: PBEPBE/SDD
title: #p freq=noraman PBEPBE/SDD
converged: YES YES NO NO
title: Mulliken charges:
elementType: N N N N C C C C C C C H H H H
charge: 0.041823 0.036941 0.041663 0.037056 -0.465923 -0.110747 -0.110484 -0.170192 -0.169688 -0.170195 -0.169729 0.276414 0.276161 0.328530 0.328370
chargesum: 0.00000
title: Mulliken charges with hydrogens summed into heavy atoms:
elementType: N N N N C C C C C C C
charge: 0.041823 0.036941 0.041663 0.037056 0.086651 0.217783 0.217887 -0.170192 -0.169688 -0.170195 -0.169729
polarizability: 9.51878487e+01 1.90807970e-02 8.14061540e+01 2.71127380e+00 -1.25053087e-02 7.47397411e+01
1716.lowfreq: -8.4280 -7.5819 0.0007 0.0007 0.0007 6.8202 38.8826 69.1328 83.6099
frequency: 38.8722 69.1318 83.6099 109.8799 136.9913 188.1001 188.8607 236.0323 302.8328 367.5896 368.9436 454.7480 473.3508 558.1318 563.7541 564.6850 601.1052 777.2001 838.8261 943.8542 997.2633 1026.5956 1050.3787 1065.3255 1173.9893 1243.8499 1276.2789 1283.9283 1313.2278 1340.1689 1465.6391 2206.9221 2207.0533 2213.2391 2214.1083 2977.0707 2978.0040 3040.5034 3114.0692
redmass: 11.0288 7.0484 11.4315 13.0170 11.1445 9.0895 5.9724 3.3639 7.8875 8.1560 8.3948 11.5331 7.2005 6.0662 12.2250 11.2502 3.1898 3.2929 4.9923 3.1618 4.6851 2.6347 3.6907 3.7839 1.1680 1.2231 1.3046 1.3174 1.2328 1.3728 1.0781 12.5515 12.5622 12.5773 12.5824 1.0812 1.0813 1.0600 1.1069
irintensity: 1.8046 11.7907 4.3402 2.3940 12.5855 4.1116 3.2477 0.8134 0.4419 0.1099 0.3611 0.0860 0.5926 3.4182 1.2147 0.4340 15.8539 5.3111 0.1596 8.8283 0.0037 13.2627 8.7352 3.8346 1.7139 18.0176 0.9035 1.2160 0.9277 2.9438 10.9343 0.0828 0.1383 0.0822 0.9669 2.0851 0.4858 2.4636 2.1397
temp: 298.150 k
press: 1.00000 atm
elementType: 7 7 7 7 6 6 6 6 6 6 6 1 1 1 1
symmnumber: 1
zpe: 251539.5 jmol-1
zpe.correction: 0.095806 hartree
zpe.thermalcorrener: 0.106827 hartree
zpe.thermalcorrenthalpy: 0.107771 hartree
zpe.thermalcorrgfe: 0.057706 hartree
zpe.sumelectzpe: -487.295134 hartree
zpe.sumelectthermal: -487.284113 hartree
zpe.sumelectthermalent: -487.283169 hartree
zpe.sumelectthermalfe: -487.333234 hartree
dipole: -0.0091 -0.4265 -0.0136
dipole: 0.4268
quadrupole: -87.3692 -72.8835 -69.7288
quadrupole: -0.0181 2.7246 0.0116
quadrupole: -10.7087 3.7770 6.9317 -0.0181 2.7246 0.0116
hfenergy: -487.3909404 hartree
pointgroup: C01 [X(C7H4N4)]
dipole: -0.0050984 0.1676259 0.0087236 debye
dipolederiv: -0.1311719 -0.0394018 0.0107957 -0.0088613 -0.1519276 -0.0022617 -0.0034778 0.0155278 -0.17782 -0.180525 0.0079607 0.0257137 0.0125369 -0.1609993 0.0492751 0.0190799 0.0178912 -0.1252929 -0.1340739 0.0403037 0.0125028 0.0091472 -0.1491924 0.0035802 -0.0024078 -0.0149164 -0.1783912 -0.1792207 -0.0095476 0.0266404 -0.0140336 -0.1590504 -0.0500866 0.0189795 -0.0183437 -0.1284011 0.3010837 0.0020671 0.0397693 0.0033449 0.0109338 0.0010712 -0.0105252 -0.0001213 0.0181939 0.1750752 -0.0116876 0.0190159 0.0361437 0.2964925 -0.00427 -0.0119489 0.0037311 0.3178448 0.1746314 0.0075887 0.0198085 -0.0376917 0.2956383 0.0031544 -0.0135835 -0.005363 0.3178901 -0.0469301 -0.0597145 -0.0427658 -0.1316777 -0.0382037 -0.0122364 -0.0493696 -0.014785 -0.0811463 -0.1401342 0.0089307 -0.0035075 0.0239539 -0.0426083 0.0262467 0.0451865 0.0338445 0.0005591 -0.0489639 0.0608531 -0.0412648 0.1332918 -0.036924 0.0133239 -0.0444457 0.0159777 -0.0796025 -0.1398425 -0.0110611 -0.0029458 -0.0283103 -0.039706 -0.0285546 0.0454997 -0.0352723 -0.00276 0.0424839 -0.0388071 -0.0327423 -0.0104872 0.0495125 -0.065702 -0.0010104 -0.0695987 0.009774 0.0415857 0.0402107 -0.0324134 0.0104372 0.0435599 0.0666375 -0.0020541 0.07139 0.0162782 0.1322943 0.0207979 0.0012421 0.006427 0.0417509 -0.007441 0.0052355 -0.0083191 0.046054 0.1337081 -0.018493 0.000151 -0.0042209 0.0407239 0.0072634 0.004842 0.0083571 0.0468197 unknown
polarizability: 95.072946|0.1758889|81.4062076|-3.1062864|0.0869669|74.8545903 unknown
InChI: InChI=1S/C7H4N4/c8-2-6(3-9)1-7(4-10)5-11/h6-7H,1H2
charge 0 multiplicity 1
15 atoms
N  -3.364778 1.451726 0.917923
N  -1.75005 -1.657289 -1.81283
N  3.319583 1.565087 -0.834423
N  1.786957 -1.702147 1.75663
C  -0.011713 0.813703 0.032479
C  -1.268636 -0.083911 0.295442
C  1.261965 -0.045089 -0.275933
C  -2.438189 0.759568 0.632496
C  -1.561426 -0.955195 -0.868572
C  2.412657 0.836481 -0.578058
C  1.578361 -0.963053 0.845378
H  0.166638 1.439208 0.922872
H  -0.202737 1.478541 -0.826105
H  -1.062442 -0.741519 1.166299
H  1.065611 -0.665812 -1.175699
