program: Gaussian 09
title: 000077278
version: EM64L-G09RevD.01
frameworkgroup: C1[X(C8H11NO3S)]
method: RPBEPBE
basis: SDD
operation: Freq
keyword: #p
keyword: freq=noraman
keyword: PBEPBE/SDD
title: #p freq=noraman PBEPBE/SDD
converged: YES YES NO NO
title: Mulliken charges:
elementType: S O O O N C C C C C C C C H H H H H H H H H H H
charge: 0.983619 -0.569900 -0.512448 -0.507970 -0.695972 0.380264 -0.556459 0.349368 -0.024090 -0.379530 -0.433984 -0.290090 -0.671378 0.232484 0.199192 0.241792 0.276556 0.280187 0.219420 0.222664 0.233950 0.323664 0.319555 0.379104
chargesum: 0.00000
title: Mulliken charges with hydrogens summed into heavy atoms:
elementType: S O O O N C C C C C C C C
charge: 0.983619 -0.190796 -0.512448 -0.507970 -0.052752 0.380264 -0.124783 0.349368 -0.024090 -0.137738 -0.157428 -0.009903 0.004656
polarizability: 1.81330342e+02 4.56576830e+00 1.32337749e+02 -2.12459561e+00 2.35861672e+00 8.32298699e+01
1716.lowfreq: -15.5504 -2.6888 -0.0003 0.0015 0.0029 7.0932 25.4954 59.4355 86.0266
frequency: 25.4078 59.3718 85.8983 122.4503 129.5931 160.4680 190.6166 200.7701 220.1551 244.3090 264.4067 316.0588 328.5666 329.4019 365.1723 390.7983 414.3460 422.4583 457.2851 479.5085 535.3058 540.1723 596.9728 625.0698 718.1077 748.8831 787.0141 816.7979 828.1841 867.7058 877.0102 951.5720 961.6867 963.5451 1020.1266 1039.3344 1050.5577 1059.9418 1083.9784 1144.4476 1196.4143 1236.1720 1277.2317 1298.5281 1316.5064 1388.1974 1397.9025 1437.1934 1470.2026 1478.6669 1495.2130 1500.1470 1575.4757 1618.8348 1646.6098 2964.6136 2984.3134 3037.6123 3080.2197 3088.3350 3135.1952 3144.7678 3180.2425 3480.2980 3571.6242 3710.5337
redmass: 5.5800 4.4853 3.0815 5.0353 4.8108 1.4682 1.4539 2.5622 3.6182 5.5469 3.2882 4.8611 3.1154 4.6401 1.2620 2.4351 2.7869 1.9906 3.4455 3.1911 5.2655 9.1266 5.5854 4.6157 4.2009 2.9070 1.2076 1.3645 10.6686 4.3059 1.7197 1.3611 2.4863 11.7691 1.7256 1.5696 1.1837 1.9916 1.6613 1.2890 2.5704 1.3031 1.4144 1.7412 1.6361 1.3088 3.5644 4.2326 1.0581 1.1801 1.3288 1.7774 7.2141 4.4277 1.2895 1.0664 1.0355 1.0946 1.1000 1.1006 1.0900 1.0920 1.0954 1.0661 1.0454 1.1035
irintensity: 2.1412 0.1533 0.1230 0.9051 1.5290 56.8636 1.5703 6.8277 4.3577 5.8368 40.6270 8.0543 20.0096 21.5374 95.5222 109.9926 80.5398 47.0669 4.8393 6.1667 24.0650 125.1439 18.0285 50.3499 0.3071 0.5365 1.7785 35.2012 71.1714 13.5822 35.2520 2.1476 11.8816 84.3938 5.9583 15.4349 64.3434 19.8703 39.8864 8.8609 1.1003 0.1039 6.8698 11.0006 6.9357 13.9600 18.5093 36.8850 18.6073 7.1241 40.4260 64.3556 3.0544 27.1614 223.7805 40.7864 36.8642 8.1781 48.4223 30.7155 12.5469 6.1828 4.3941 37.9408 68.8189 26.1544
temp: 298.150 k
press: 1.00000 atm
elementType: 16 8 8 8 7 6 6 6 6 6 6 6 6 1 1 1 1 1 1 1 1 1 1 1
symmnumber: 1
zpe: 473329.5 jmol-1
zpe.correction: 0.180282 hartree
zpe.thermalcorrener: 0.194787 hartree
zpe.thermalcorrenthalpy: 0.195731 hartree
zpe.thermalcorrgfe: 0.138686 hartree
zpe.sumelectzpe: -988.780998 hartree
zpe.sumelectthermal: -988.766493 hartree
zpe.sumelectthermalent: -988.765548 hartree
zpe.sumelectthermalfe: -988.822594 hartree
dipole: 6.5772 1.0901 1.0244
dipole: 6.7452
quadrupole: -79.2899 -78.1416 -89.8948
quadrupole: 4.2562 -10.0267 0.0164
quadrupole: 3.1522 4.3005 -7.4527 4.2562 -10.0267 0.0164
hfenergy: -988.9612797 hartree
pointgroup: C01 [X(C8H11N1O3S1)]
dipole: -2.5989267 -0.3785003 0.3804737 debye
dipolederiv: 2.0602132 -0.0291791 0.1007786 -0.0772008 1.2210198 0.0399507 0.2691793 0.0296424 1.6499185 -0.5116425 -0.0286481 -0.203529 -0.0269335 -0.5496317 -0.0410393 -0.2926483 -0.0344398 -1.0262793 -0.7224891 0.062149 -0.0067473 0.1126984 -0.6326951 -0.1011284 -0.0303419 -0.018315 -0.497834 -0.7617987 -0.059461 0.0375773 -0.0809576 -0.5476098 0.1161697 -0.0089916 0.0340889 -0.531635 -0.6451575 -0.5935648 0.0336897 -0.6642746 -0.9746163 -0.038744 0.1025334 -0.0187752 -0.6789613 0.3124214 0.0246184 -0.0130813 -0.4018624 -0.2488178 -0.0115494 0.0475816 0.0233487 -0.1269825 0.0192167 -0.0156745 0.0417537 -0.0380921 0.1404818 0.0292397 0.1547239 -0.0067166 0.1032866 0.39585 0.7874663 -0.0148833 0.8478189 0.9032125 0.0106306 -0.0799053 0.0055943 0.1299516 -0.1165659 0.098991 0.0298588 -0.0992481 0.2040957 -0.0256334 0.1692755 -0.0322257 -0.111447 0.1367866 -0.0609779 0.0370539 0.139365 0.1380402 -0.0124447 -0.0010415 -0.0216785 -0.1197631 -0.276011 -0.4808055 0.0073569 0.3322016 -0.1847878 0.0221435 -0.0546629 -0.0195645 -0.159947 -0.4071252 0.111136 -0.0302462 -0.1776197 -0.210327 -0.0117147 -0.0206885 -0.0070993 -0.1406279 -0.0199804 0.0160596 0.0320534 0.0207568 0.0593039 -0.0088667 -0.0788601 0.0266036 -0.0054883 0.0379785 -0.0016196 0.0119147 0.0847321 -0.0923775 0.1139105 -0.00804 0.0677344 0.0226937 -0.0427166 -0.0239804 -0.0357712 -0.0963273 -0.0345942 -0.1460904 -0.0466985 -0.0798025 -0.0372663 0.0054887 0.0952922 -0.025758 0.0794969 -0.0453336 0.0218358 -0.0154045 0.0242839 0.1390922 0.1252691 0.0369588 0.0033259 0.0136958 0.0178047 0.0129022 0.0020503 0.0064606 0.1652653 0.0863464 -0.0611935 0.0079397 -0.0401368 0.0774198 0.0026742 0.0003336 0.0164638 0.1695415 0.1119092 0.0564227 -0.025329 0.009205 -0.0929101 0.1155677 -0.0249604 0.0571446 0.0262515 -0.2532055 0.0392307 0.0152428 0.0255819 0.1047881 0.0025208 0.0240762 -0.0047261 0.063846 0.0849834 -0.0852333 -0.0491344 -0.0340108 -0.0278424 -0.1140784 -0.0133737 -0.0704598 -0.0111093 0.1688834 0.0471412 -0.0194348 0.0026392 0.2081697 0.0257256 -0.034454 0.0227925 0.3463295 0.1338957 0.0375234 -0.0137608 0.054345 0.2238192 0.0134522 -0.0289713 0.0027784 0.3658889 0.0774502 0.0273484 0.0791299 0.0141271 0.3433878 -0.0154339 -0.0307113 -0.0031334 0.2652755 unknown
polarizability: 181.4009613|3.8718278|132.0726308|3.1788314|-3.4441584|83.4243687 unknown
InChI: InChI=1S/C8H11NO3S/c1-2-6-3-4-7(5-8(6)9)13(10,11)12/h3-5,10H,2,9H2,1H3
charge 0 multiplicity 1
24 atoms
S  2.718434 -0.145652 0.0432
O  2.82604 0.064655 1.890547
O  3.1341 -1.668991 -0.31696
O  3.495696 1.095542 -0.645835
N  -2.124185 -2.098162 -0.119844
C  -1.898999 0.350574 -0.305406
C  -3.407158 0.53094 -0.390274
C  -1.323662 -0.958659 -0.154358
C  0.867143 0.071019 -0.083413
C  -1.044113 1.47443 -0.35076
C  0.088927 -1.090118 -0.03994
C  0.361178 1.369429 -0.236172
C  -4.104946 0.444861 0.99693
H  -3.631216 1.51632 -0.837661
H  -3.853079 -0.218129 -1.077767
H  -1.491641 2.467127 -0.477712
H  0.56537 -2.071306 0.062575
H  1.020482 2.239523 -0.283131
H  -3.898849 -0.515148 1.504406
H  -5.200033 0.550967 0.892371
H  -3.743407 1.250332 1.659861
H  -3.132527 -2.036878 -0.214793
H  -1.705381 -3.020634 -0.043545
H  3.796929 0.030257 2.134482
