program: Gaussian 09
title: 000077268
version: EM64L-G09RevD.01
frameworkgroup: C1[X(C13H19NO2)]
method: RPBEPBE
basis: SDD
operation: Freq
keyword: #p
keyword: freq=noraman
keyword: PBEPBE/SDD
title: #p freq=noraman PBEPBE/SDD
converged: YES YES NO NO
title: Mulliken charges:
elementType: O O N C C C C C C C C C C C C C H H H H H H H H H H H H H H H H H H H
charge: -0.278616 -0.278733 -0.112948 -0.342193 -0.355599 0.123409 0.151679 0.238102 -0.658442 -0.652346 -0.349947 -0.366853 -0.253744 -0.229422 -0.246480 -0.682430 0.257857 0.199981 0.254486 0.209565 0.203503 0.253264 0.211388 0.212974 0.233362 0.214188 0.253909 0.245214 0.229756 0.225426 0.202824 0.215475 0.208034 0.237916 0.225441
chargesum: 0.00000
title: Mulliken charges with hydrogens summed into heavy atoms:
elementType: O O N C C C C C C C C C C C C C
charge: -0.278616 -0.278733 -0.112948 0.115644 0.108452 0.123409 0.151679 0.238102 0.009713 0.008179 -0.096038 -0.121640 -0.023988 -0.003996 0.171820 -0.011040
polarizability: 1.81938574e+02 -1.22175346e+01 1.63619306e+02 4.62582033e+00 7.29886172e+00 1.17887722e+02
1716.lowfreq: -7.9200 -4.1984 -0.0010 -0.0007 -0.0004 1.8156 26.4977 31.8640 47.6610
frequency: 26.2231 31.1075 47.6468 59.7004 67.3102 88.0828 101.1342 122.8103 134.6925 190.4105 206.4738 210.7239 229.9379 243.7424 271.1410 305.0019 314.3671 349.9706 366.7071 421.9487 435.7813 494.0754 515.5898 565.5177 589.8505 614.9986 676.1610 708.2993 753.6586 758.2754 765.4285 770.9782 778.0560 825.6616 852.9197 862.8490 906.0908 937.2316 940.7712 974.5411 1001.5723 1033.2024 1042.4675 1068.9728 1073.0840 1081.1504 1098.7753 1112.6394 1121.0888 1134.8477 1173.1862 1188.5261 1214.0063 1216.8590 1260.3394 1262.3766 1284.0016 1302.7155 1337.8237 1357.1221 1359.6060 1379.9263 1382.9634 1384.8924 1399.9422 1413.3746 1434.6893 1452.2375 1459.8820 1465.6890 1469.0217 1471.8724 1473.7694 1478.1389 1483.3989 1484.7514 1492.5669 1557.8380 1587.9113 1602.6401 2955.1973 2981.5214 2982.7455 2997.1461 2998.8431 3005.5059 3015.4996 3064.4915 3073.6890 3081.3515 3085.2736 3094.4163 3101.7972 3106.1419 3108.3909 3131.0743 3142.9062 3159.3581 3170.8828
redmass: 3.4309 2.8723 3.6384 2.8168 3.8252 2.5563 4.1840 2.0083 3.1949 2.5021 3.0807 1.1664 1.3019 1.3107 4.7748 2.6132 2.9792 3.3870 3.5621 2.6607 4.6228 3.4942 3.5618 3.6959 5.7972 4.7511 4.2365 6.6841 1.5587 3.0178 2.4593 1.2683 1.3958 1.1318 1.5444 2.1826 3.3598 1.5054 1.8473 1.3227 2.9804 2.7758 2.3313 2.1510 2.4879 1.8927 1.7850 2.1555 1.7509 1.4354 1.0746 2.2267 3.2832 2.7157 1.2350 1.3608 1.4382 1.3975 1.2708 1.3040 1.6501 3.3441 1.2160 1.2178 1.2904 2.3377 2.3878 1.1343 1.0406 1.0510 1.0441 1.6388 1.1237 1.1199 1.1447 1.0928 1.2109 6.3192 7.1164 6.3336 1.0560 1.0353 1.0359 1.0363 1.0681 1.0635 1.1068 1.1002 1.0987 1.0996 1.0980 1.0990 1.1014 1.1013 1.0961 1.0853 1.0903 1.0938 1.0998
irintensity: 1.0206 0.1293 2.5229 0.2837 1.9928 3.7114 1.5380 1.3183 0.4296 0.2447 1.0315 0.6302 1.1913 1.0175 0.3447 2.9325 0.0619 2.9045 10.8627 5.7401 0.2309 4.1708 9.0952 0.8673 6.8500 5.5333 5.3343 14.2140 81.2733 9.2493 15.4434 5.0415 4.9261 0.8220 5.6239 16.6162 30.9696 0.5208 9.6796 0.0860 0.7381 56.2232 22.6257 11.0915 22.4449 24.3977 15.5250 9.5715 38.4947 4.5432 7.8534 3.9685 173.5229 22.1679 14.1228 35.9676 41.8157 40.7284 7.1661 7.6426 8.5587 7.3152 3.0604 34.1316 36.1981 68.5566 94.1992 25.2034 10.1642 9.7657 8.8565 52.4392 17.5934 9.2239 0.2776 15.2968 3.9023 241.6133 20.1018 50.0419 46.1172 24.9432 27.6181 18.9499 32.4111 42.9481 31.6559 8.8779 18.9587 45.0248 33.6315 32.2554 23.8689 33.3101 34.6394 1.7744 9.5717 25.2343 18.3772
temp: 298.150 k
press: 1.00000 atm
elementType: 8 8 7 6 6 6 6 6 6 6 6 6 6 6 6 6 1 1 1 1 1 1 1 1 1 1 1 1 1 1 1 1 1 1 1
symmnumber: 1
zpe: 773816.2 jmol-1
zpe.correction: 0.294731 hartree
zpe.thermalcorrener: 0.312386 hartree
zpe.thermalcorrenthalpy: 0.313331 hartree
zpe.thermalcorrgfe: 0.247578 hartree
zpe.sumelectzpe: -710.753104 hartree
zpe.sumelectthermal: -710.735449 hartree
zpe.sumelectthermalent: -710.734505 hartree
zpe.sumelectthermalfe: -710.800258 hartree
dipole: 0.8566 2.3373 4.2265
dipole: 4.9051
quadrupole: -84.2198 -86.3396 -105.7723
quadrupole: 2.2273 -2.8063 -2.1820
quadrupole: 7.8908 5.7710 -13.6618 2.2273 -2.8063 -2.1820
hfenergy: -711.0478355 hartree
pointgroup: C01 [X(C13H19N1O2)]
dipole: -0.1518073 -0.7313701 1.7793851 debye
polarizability: 185.9640252|-8.0404665|156.632178|-1.8911997|-13.4355859|120.8493987 unknown
InChI: InChI=1S/C13H19NO2/c1-4-14(5-2)13(15)11-9-7-8-10-12(11)16-6-3/h7-10H,4-6H2,1-3H3
charge 0 multiplicity 1
35 atoms
O  -0.216069 -1.601052 0.332629
O  0.980469 0.949537 -2.095946
N  1.74211 0.886157 0.100888
C  3.137519 1.048041 -0.373856
C  1.518581 0.838981 1.561885
C  0.736873 0.815448 -0.850288
C  -0.696504 0.632681 -0.386754
C  -1.184121 -0.600436 0.133411
C  3.830509 -0.308983 -0.622331
C  1.433519 2.243512 2.199941
C  -1.619532 1.674777 -0.632582
C  -2.561909 -0.768202 0.417861
C  -2.993674 1.523335 -0.33942
C  -3.459367 0.298091 0.184761
C  -0.676053 -2.944751 0.737673
C  0.561077 -3.837848 0.782141
H  3.106622 1.623685 -1.314762
H  3.690969 1.638566 0.38001
H  0.597687 0.273146 1.767155
H  2.350482 0.265268 2.014114
H  3.854264 -0.925986 0.294949
H  3.290947 -0.868106 -1.405105
H  4.872015 -0.152601 -0.959402
H  2.343806 2.835775 1.994974
H  0.56518 2.796958 1.801097
H  1.318587 2.161767 3.296818
H  -1.248364 2.604327 -1.077504
H  -2.941402 -1.714893 0.812918
H  -3.690555 2.345464 -0.531129
H  -4.523684 0.162649 0.407516
H  -1.166124 -2.886452 1.731709
H  -1.415541 -3.315723 -0.000891
H  0.27808 -4.86349 1.081312
H  1.043572 -3.880606 -0.208821
H  1.295731 -3.451437 1.509428
