program: Gaussian 09
title: 000077273
version: EM64L-G09RevD.01
frameworkgroup: C1[X(C17H18Cl2N2S)]
method: RPBEPBE
basis: SDD
operation: Freq
keyword: #p
keyword: freq=noraman
keyword: PBEPBE/SDD
title: #p freq=noraman PBEPBE/SDD
converged: YES YES NO NO
title: Mulliken charges:
elementType: Cl Cl S N N C C C C C C C C C C C C C C C C C H H H H H H H H H H H H H H H H H H
charge: -0.030319 -0.055046 0.278741 -0.298461 -0.104867 -0.400277 -0.432939 -0.342135 0.558593 0.496606 -0.341675 -0.351535 -0.290909 -0.324878 -0.114773 -0.267907 -0.618089 -0.610269 -0.104671 -0.236385 -0.306132 -0.251587 0.210679 0.257526 0.241605 0.209651 0.191518 0.231103 0.278923 0.243916 0.250795 0.221587 0.191836 0.224811 0.190189 0.238662 0.218538 0.229430 0.284143 0.234003
chargesum: 0.00000
title: Mulliken charges with hydrogens summed into heavy atoms:
elementType: Cl Cl S N N C C C C C C C C C C C C C C C C C
charge: -0.030319 -0.055046 0.278741 -0.298461 -0.104867 0.067928 0.018317 0.080485 0.558593 0.496606 -0.341675 -0.351535 -0.011986 -0.080962 -0.114773 -0.017112 0.020145 0.037120 -0.104671 -0.006955 -0.021989 -0.017584
polarizability: 2.86152327e+02 -4.42533477e+01 2.52663978e+02 -3.61414100e+01 -2.59817177e+01 1.76704507e+02
1716.lowfreq: -8.2455 -4.9543 0.0015 0.0017 0.0022 3.1954 13.8096 28.4047 34.1004
frequency: 13.6104 28.3891 33.9838 42.7757 54.0331 71.4024 107.2557 121.8088 141.2309 161.6571 167.4041 191.6956 215.2084 219.3537 229.4662 251.4349 274.7536 290.2081 306.1854 322.5355 335.3792 366.1822 378.4475 396.4095 403.3161 411.5000 434.6464 453.2316 466.6900 508.1949 527.5476 530.0943 546.4595 574.5531 587.0328 627.1275 672.9175 704.4219 723.2356 729.7730 754.4093 765.0019 776.6313 830.4647 833.3839 849.7908 853.8691 876.4853 917.7900 931.8845 970.7414 974.0911 1004.2976 1022.6482 1033.0526 1034.8247 1043.5986 1071.8557 1078.2894 1090.6438 1102.2373 1109.8653 1131.1025 1136.5047 1160.6034 1173.9000 1183.7777 1215.7924 1243.6016 1254.2417 1268.1057 1271.4612 1298.7866 1316.3160 1347.9565 1353.3264 1365.1937 1368.4539 1379.8941 1399.6342 1417.1250 1422.4675 1435.4910 1438.0617 1457.4871 1462.7147 1467.7957 1469.4441 1475.6904 1476.7099 1483.0510 1485.4380 1548.1201 1571.9530 1579.4088 1606.6082 2851.8012 2858.1603 2873.7198 2956.7077 2997.3665 3020.8867 3023.6479 3030.5870 3052.7777 3075.9431 3078.0178 3081.8795 3134.7199 3144.4843 3159.8811 3172.5734 3185.0253 3192.7480
redmass: 4.7402 4.6315 3.1735 5.5635 6.1695 4.2519 4.7106 4.8776 5.7186 4.9099 8.5188 4.7676 2.5754 1.2521 1.3665 4.2214 6.9641 2.9809 6.6851 5.0156 3.1470 5.4110 2.6551 3.6348 3.1756 2.6697 3.5049 6.4725 3.7296 3.8188 4.6572 4.4597 4.5054 5.3479 4.9473 5.6635 6.1894 4.9633 3.6874 2.5400 1.3772 6.6855 6.7149 1.4451 1.8017 1.4110 1.4467 2.7266 4.6633 1.3782 2.0246 1.3187 2.8658 5.1219 3.1943 1.5769 2.2120 1.9530 2.0962 1.5486 2.9928 1.6212 1.5130 1.5823 1.7928 1.0787 1.7436 1.3965 2.6945 1.6030 2.2754 1.9460 1.3700 1.9156 1.3686 1.5589 4.6891 1.4289 8.3546 2.8723 1.1416 2.8410 2.7579 1.1679 1.0699 1.0509 1.4011 1.5499 1.1052 1.0681 1.1817 1.0540 7.3646 7.8035 6.9212 7.3204 1.0570 1.0641 1.0625 1.0682 1.0630 1.0735 1.0723 1.0886 1.0988 1.0940 1.1003 1.1008 1.0852 1.0903 1.0938 1.1005 1.0917 1.0938
irintensity: 0.1798 0.2352 0.5745 0.1486 0.6312 0.1154 0.0311 0.1897 0.3532 0.8013 0.7921 0.8820 0.3538 0.2340 1.0416 0.1082 3.0420 3.9415 3.8731 2.4884 2.2195 16.0480 2.8772 2.0466 0.7075 3.6733 9.6406 2.4426 3.4814 6.5334 0.8472 6.9211 12.4501 8.4793 2.7317 0.3138 4.0949 0.3472 0.6098 63.5442 72.3764 31.2937 26.1163 20.7749 11.9457 24.5420 7.1977 6.7725 85.2380 2.7816 22.5867 0.3659 13.1469 43.7745 19.0221 13.3475 11.0741 19.4350 1.2348 4.2591 42.9567 25.0673 9.1964 4.8870 16.7463 0.8612 1.5290 52.1329 45.3015 15.4691 11.8476 6.5566 9.2110 69.6561 17.9264 3.8325 24.4416 8.2496 14.5458 57.9619 2.4318 71.5071 127.5419 13.8121 5.0659 13.1308 56.5496 46.2570 28.0517 15.4776 14.8710 10.4387 92.8096 147.9267 28.2881 41.8667 79.9898 53.2896 246.1082 46.3853 34.1900 28.8334 44.4140 9.1421 38.6269 12.4078 18.1252 49.8416 1.6828 7.5094 18.9992 20.0734 0.5929 2.8987
temp: 298.150 k
press: 1.00000 atm
elementType: 17 17 16 7 7 6 6 6 6 6 6 6 6 6 6 6 6 6 6 6 6 6 1 1 1 1 1 1 1 1 1 1 1 1 1 1 1 1 1 1
symmnumber: 1
zpe: 814086.0 jmol-1
zpe.correction: 0.310069 hartree
zpe.thermalcorrener: 0.331574 hartree
zpe.thermalcorrenthalpy: 0.332519 hartree
zpe.thermalcorrgfe: 0.257235 hartree
zpe.sumelectzpe: -2084.665292 hartree
zpe.sumelectthermal: -2084.643787 hartree
zpe.sumelectthermalent: -2084.642843 hartree
zpe.sumelectthermalfe: -2084.718126 hartree
dipole: -3.9336 -1.4979 0.8979
dipole: 4.3039
quadrupole: -149.7635 -145.4446 -150.5940
quadrupole: 1.2934 -3.4812 1.7688
quadrupole: -1.1628 3.1562 -1.9933 1.2934 -3.4812 1.7688
hfenergy: -2084.9753614 hartree
pointgroup: C01 [X(C17H18Cl2N2S1)]
dipole: 1.4888345 0.69803 0.4041154 debye
polarizability: 297.4715083|-42.3605436|233.0826082|22.5459081|39.943689|184.966696 unknown
InChI: InChI=1S/C17H18Cl2N2S/c1-20(2)8-5-9-21-14-6-3-4-7-16(14)22-17-13(19)10-12(18)11-15(17)21/h3-4,6-7,10-11H,5,8-9H2,1-2H3
charge 0 multiplicity 1
40 atoms
Cl -3.638824 -2.067231 -2.070054
Cl -4.572053 1.974257 1.605533
S  -0.415464 -1.792331 -1.586564
N  0.276393 0.224946 0.610316
N  2.877187 2.349814 -0.928733
C  0.837912 1.495746 1.137527
C  0.632309 2.680725 0.166354
C  1.41553 2.47667 -1.150566
C  -1.116842 0.135703 0.344069
C  1.063603 -0.970142 0.66802
C  -1.609824 -0.806352 -0.611106
C  0.826447 -2.027059 -0.250407
C  -2.042587 0.974058 1.023875
C  2.076623 -1.152299 1.647148
C  -2.996395 -0.887937 -0.841803
C  1.564251 -3.225416 -0.199118
C  3.535611 3.643356 -0.65604
C  3.556211 1.602209 -2.008417
C  -3.412016 0.870775 0.7332
C  2.846028 -2.33537 1.675364
C  -3.928165 -0.051584 -0.192618
C  2.595461 -3.378162 0.756089
H  0.437322 1.731925 2.145573
H  1.927971 1.357981 1.223273
H  -0.437345 2.82671 -0.072504
H  0.969286 3.601705 0.681063
H  1.174417 3.311882 -1.855714
H  1.061037 1.541812 -1.623019
H  -1.699426 1.687245 1.775277
H  2.259448 -0.375255 2.394785
H  1.340807 -4.026967 -0.911102
H  3.070031 4.138313 0.214182
H  3.483453 4.35182 -1.522179
H  4.600751 3.474739 -0.415932
H  3.513995 2.117643 -3.001176
H  3.093028 0.605889 -2.117469
H  4.620239 1.457806 -1.746968
H  3.631255 -2.446185 2.431006
H  -4.99568 -0.117027 -0.410169
H  3.184318 -4.300409 0.784004
