program: Gaussian 09
title: 000077225
version: EM64L-G09RevD.01
frameworkgroup: C1[X(C8H18O2)]
method: RPBEPBE
basis: SDD
operation: Freq
keyword: #pfreq=noraman
keyword: PBEPBE/SDD
title: #p freq=noraman PBEPBE/SDD
converged: YES YES NO NO
title: Mulliken charges:
elementType: O O C C C C C C C C H H H H H H H H H H H H H H H H H H
charge: -0.274197 -0.279973 -0.403103 0.052380 -0.343781 -0.694577 -0.202570 -0.219750 -0.683226 -0.673650 0.187102 0.208049 0.169228 0.227219 0.214079 0.217261 0.202236 0.207272 0.224143 0.175986 0.192089 0.183134 0.201728 0.223929 0.231345 0.202165 0.224542 0.230941
chargesum: 0.00000
title: Mulliken charges with hydrogens summed into heavy atoms:
elementType: O O C C C C C C C C
charge: -0.274197 -0.279973 -0.007952 0.221608 0.097518 -0.067808 0.197559 0.155473 -0.026224 -0.016002
polarizability: 1.04206679e+02 -1.85656447e+00 1.03774308e+02 -9.55323259e-01 4.23570109e-01 8.21976459e+01
1716.lowfreq: -6.7126 -0.0005 0.0004 0.0005 8.6741 9.8957 36.5614 48.1230 49.9232
frequency: 36.4494 47.8936 49.5659 69.2510 81.6245 92.7445 164.9844 204.4990 224.5211 229.0411 246.8196 246.9112 300.2611 326.0985 331.6876 455.4105 534.2313 650.3387 740.1668 796.5068 811.6907 814.6791 826.7742 881.8388 889.3975 928.9408 973.7445 1036.5786 1043.3368 1056.1183 1088.5236 1102.9300 1117.6969 1132.5960 1135.9209 1139.4837 1145.5687 1232.1447 1244.5740 1253.0778 1288.3797 1290.9966 1318.0965 1324.0634 1359.5629 1374.4764 1383.3722 1387.4973 1393.9274 1398.0499 1452.8493 1459.5327 1459.8253 1476.0617 1476.5948 1478.8446 1480.9857 1488.5934 1492.9658 1493.9834 2846.0889 2917.6029 2931.5486 2966.6756 2967.8910 2977.7147 2992.0324 2992.8345 3004.3926 3026.0631 3029.7889 3045.6499 3069.4478 3077.3572 3089.2412 3090.5380 3099.5716 3100.2110
redmass: 2.1218 2.7529 1.7837 3.1102 1.6264 2.5556 2.8346 2.2870 1.4079 1.5902 1.3995 1.4476 3.0450 3.1722 3.1465 2.9122 4.1628 4.1819 1.1937 2.0871 1.1620 1.1642 1.9802 1.5572 2.2324 2.5853 2.1150 2.8711 3.3865 2.9874 2.3990 2.0440 2.0648 2.0250 1.7387 1.4863 1.9519 1.2845 1.1604 1.1467 1.4929 1.1045 1.2154 1.2186 1.5323 1.3738 1.2504 1.2208 1.2774 1.3321 1.0822 1.0410 1.0414 1.0438 1.0455 1.0463 1.0469 1.0872 1.0809 1.0809 1.0824 1.0566 1.0655 1.0380 1.1011 1.0615 1.0358 1.0358 1.0615 1.0979 1.0958 1.1001 1.0984 1.1029 1.0988 1.0991 1.1011 1.1009
irintensity: 0.7008 0.6542 0.6726 0.7510 0.1027 4.8613 5.7877 0.5918 1.1526 0.8861 1.1913 3.9550 0.4514 4.3044 2.4852 1.4757 1.3560 3.2890 0.1954 46.5783 5.5925 5.7757 1.6654 5.7291 3.6597 124.1356 52.4950 20.6030 137.5412 31.8543 41.9166 1.3266 9.0064 47.0941 18.9185 6.9225 45.8397 3.0888 5.1894 1.1586 32.9894 2.2850 36.1110 30.0622 1.5528 2.6317 12.8081 14.0970 14.8938 13.7740 6.9025 12.7362 9.8957 13.6979 3.3639 2.7349 6.9693 16.8020 5.4323 4.0380 78.8447 63.4961 78.4043 54.6999 41.9466 48.7747 29.5560 21.9855 21.5758 17.2068 27.7076 1.9880 51.9118 80.7740 37.4088 37.5800 41.3882 39.1222
temp: 298.150 k
press: 1.00000 atm
elementType: 8 8 6 6 6 6 6 6 6 6 1 1 1 1 1 1 1 1 1 1 1 1 1 1 1 1 1 1
symmnumber: 1
zpe: 653088.9 jmol-1
zpe.correction: 0.248748 hartree
zpe.thermalcorrener: 0.262452 hartree
zpe.thermalcorrenthalpy: 0.263396 hartree
zpe.thermalcorrgfe: 0.206975 hartree
zpe.sumelectzpe: -465.214766 hartree
zpe.sumelectthermal: -465.201062 hartree
zpe.sumelectthermalent: -465.200118 hartree
zpe.sumelectthermalfe: -465.256539 hartree
dipole: 0.5411 1.5740 1.6293
dipole: 2.3291
quadrupole: -60.0383 -61.6996 -63.2951
quadrupole: -1.0145 0.0898 1.4585
quadrupole: 1.6394 -0.0219 -1.6174 -1.0145 0.0898 1.4585
hfenergy: -465.4635141 hartree
pointgroup: C01 [X(C8H18O2)]
dipole: 0.1015215 -0.6412277 0.6466972 debye
polarizability: 105.6365056|-0.8098798|102.3098324|1.3836056|-0.0536349|82.2322954 unknown
InChI: InChI=1S/C8H18O2/c1-4-7-8(9-5-2)10-6-3/h8H,4-7H2,1-3H3
charge 0 multiplicity 1
28 atoms
O  -1.293176 0.511745 0.104208
O  0.457091 -1.031433 -0.243924
C  0.905945 1.204491 0.788163
C  -0.062515 0.020279 0.660226
C  1.210313 1.906136 -0.553768
C  2.222538 3.059152 -0.388337
C  -2.368601 -0.501012 0.040909
C  1.326128 -2.011623 0.4242
C  -3.606325 0.190624 -0.527396
C  1.637702 -3.113369 -0.589624
H  1.848675 0.833356 1.240039
H  0.469488 1.928962 1.50407
H  -0.249139 -0.457823 1.657565
H  0.263401 2.286012 -0.978541
H  1.596698 1.155746 -1.269117
H  2.428719 3.553139 -1.355706
H  3.186559 2.692563 0.014727
H  1.840186 3.829816 0.30819
H  -2.037234 -1.339611 -0.599982
H  -2.559589 -0.893443 1.065308
H  2.263672 -1.524287 0.770556
H  0.808058 -2.427709 1.318242
H  -4.447275 -0.523469 -0.598782
H  -3.914338 1.033929 0.114819
H  -3.394984 0.584086 -1.536625
H  2.296355 -3.879102 -0.140211
H  0.70752 -3.602222 -0.927417
H  2.143926 -2.689633 -1.473989
