program: Gaussian 09
title: 000077224
version: EM64L-G09RevD.01
frameworkgroup: C1[X(C10H22O2)]
method: RPBEPBE
basis: SDD
operation: Freq
keyword: #pfreq=noraman
keyword: PBEPBE/SDD
title: #p freq=noraman PBEPBE/SDD
converged: YES YES NO NO
title: Mulliken charges:
elementType: O O C C C C C C C C C C H H H H H H H H H H H H H H H H H H H H H H
charge: -0.274444 -0.279434 -0.351596 -0.446311 -0.340905 0.043538 -0.358911 -0.696462 -0.200602 -0.218322 -0.683194 -0.674399 0.205996 0.220261 0.213858 0.193565 0.177716 0.183965 0.170937 0.195657 0.197775 0.214483 0.207761 0.209183 0.224734 0.175292 0.192300 0.183339 0.201823 0.231166 0.223779 0.202153 0.230784 0.224516
chargesum: 0.00000
title: Mulliken charges with hydrogens summed into heavy atoms:
elementType: O O C C C C C C C C C C
charge: -0.274444 -0.279434 0.074661 -0.038888 0.020775 0.214475 0.034521 -0.065035 0.199425 0.157317 -0.026426 -0.016945
polarizability: 1.32305423e+02 1.01265736e+00 1.22271162e+02 1.30032996e+00 8.70728560e-01 1.01684085e+02
1716.lowfreq: -10.7023 -8.1159 -5.0176 -0.0005 -0.0002 0.0001 25.8209 34.6057 42.4086
frequency: 25.5339 34.4770 42.3653 49.2734 57.1709 68.3113 99.9898 123.5081 130.5854 173.8173 200.7477 216.4929 230.0663 241.4324 244.6659 317.1518 322.8015 345.5549 408.7574 453.5111 534.5057 649.4381 726.0555 746.9045 796.4996 809.5396 812.7661 845.2541 858.8438 887.6870 913.0827 934.9567 970.9406 1022.2323 1033.3081 1042.7336 1062.2329 1078.0574 1096.5868 1106.3625 1117.9850 1128.2642 1133.9701 1138.4352 1148.2508 1201.5782 1239.4709 1243.5193 1249.2118 1261.4741 1281.9834 1291.0039 1300.1005 1317.8353 1323.7691 1350.3986 1357.7993 1374.5258 1381.8418 1387.5805 1393.7124 1397.4546 1451.2732 1458.1254 1459.5889 1465.1269 1470.6270 1476.6087 1478.4612 1480.6076 1482.2501 1488.6926 1492.3974 1493.3357 2843.3907 2917.5354 2933.3393 2945.8235 2967.3931 2967.5195 2969.8675 2978.4102 2987.2318 2992.4211 2992.9833 2994.2304 3020.0942 3027.1388 3031.4889 3060.6082 3067.3010 3068.6813 3089.9015 3090.5901 3099.8278 3100.4071
redmass: 3.0587 1.9563 1.9548 1.7058 2.8647 2.5921 2.7229 1.8813 2.7579 2.9556 2.3451 2.7622 1.1264 1.3056 1.4103 3.2762 2.8655 3.2357 3.1398 2.8900 4.1995 4.0621 1.0736 1.2610 1.7776 1.1190 1.1062 2.2049 1.7354 2.0510 2.5101 2.0710 1.4992 3.1283 3.0876 3.4114 2.8882 2.3872 2.2149 2.0406 2.1189 2.3722 1.5148 1.5068 1.9642 1.5099 1.3484 1.1637 1.1493 1.2427 1.0438 1.1240 1.4562 1.2540 1.2013 1.5922 1.5407 1.3734 1.2651 1.2195 1.2715 1.3326 1.0824 1.0414 1.0413 1.0680 1.0704 1.0429 1.0511 1.0514 1.0656 1.0907 1.0788 1.0818 1.0823 1.0566 1.0655 1.0589 1.0562 1.1030 1.0397 1.0615 1.0962 1.0358 1.0359 1.0623 1.1011 1.1003 1.0959 1.1033 1.1011 1.0993 1.0988 1.0991 1.1011 1.1009
irintensity: 0.8262 0.3226 0.8124 0.9280 0.3034 2.2882 1.4927 0.6401 4.3450 2.8064 0.9156 0.9890 0.0062 2.3155 1.5032 4.4369 2.6395 1.4638 2.5906 1.3579 1.1827 2.0791 6.4731 7.3964 20.8595 5.6917 4.0742 14.1615 4.4964 6.6440 54.9054 61.9667 60.0165 5.4341 10.7923 137.2893 54.6343 1.1825 25.4692 0.6416 10.2350 54.4028 7.5767 5.9419 48.4325 3.0530 25.3916 2.6262 1.1591 2.3231 0.7933 2.2499 29.0323 30.0047 33.8296 0.6982 1.6225 3.7202 13.8690 13.7809 15.0543 14.9101 6.9276 11.4217 10.9201 0.1304 0.8596 11.8389 5.6253 3.5723 4.6401 23.5000 5.2492 4.1389 84.1383 65.0346 75.0137 21.2902 64.5375 58.6365 23.4526 37.6446 8.4752 31.7321 19.0829 45.9747 28.3784 0.5799 23.6708 15.7076 133.9648 56.6642 37.8055 37.0795 41.4148 39.2925
temp: 298.150 k
press: 1.00000 atm
elementType: 8 8 6 6 6 6 6 6 6 6 6 6 1 1 1 1 1 1 1 1 1 1 1 1 1 1 1 1 1 1 1 1 1 1
symmnumber: 1
zpe: 798971.7 jmol-1
zpe.correction: 0.304312 hartree
zpe.thermalcorrener: 0.320883 hartree
zpe.thermalcorrenthalpy: 0.321827 hartree
zpe.thermalcorrgfe: 0.257488 hartree
zpe.sumelectzpe: -543.660985 hartree
zpe.sumelectthermal: -543.644415 hartree
zpe.sumelectthermalent: -543.643470 hartree
zpe.sumelectthermalfe: -543.707809 hartree
dipole: -1.3996 1.2415 1.3393
dipole: 2.3009
quadrupole: -72.3823 -73.2879 -76.4516
quadrupole: -0.1802 -1.6587 1.5539
quadrupole: 1.6583 0.7527 -2.4110 -0.1802 -1.6587 1.5539
hfenergy: -543.9652975 hartree
pointgroup: C01 [X(C10H22O2)]
dipole: 0.5027195 0.5379458 -0.526631 debye
polarizability: 132.3625573|0.103141|122.1500515|1.8032272|-0.9721082|101.7480611 unknown
InChI: InChI=1S/C10H22O2/c1-4-7-8-9-10(11-5-2)12-6-3/h10H,4-9H2,1-3H3
charge 0 multiplicity 1
34 atoms
O  1.46216 -1.159565 -0.157295
O  1.300659 1.154467 0.268429
C  -1.354214 -0.318242 0.003342
C  -0.393093 -0.008225 -1.16429
C  -2.832771 -0.345176 -0.441723
C  1.079535 0.094655 -0.743005
C  -3.809198 -0.652919 0.716693
C  -5.287628 -0.675601 0.271804
C  2.896752 -1.246753 0.191182
C  1.48324 2.494579 -0.308577
C  3.146688 -2.65821 0.718989
C  1.874791 3.434714 0.83246
H  -1.211554 0.441012 0.796854
H  -1.074878 -1.29228 0.44715
H  -0.47128 -0.794735 -1.940849
H  -0.681725 0.948578 -1.645655
H  -3.103595 0.633138 -0.893774
H  -2.966741 -1.10397 -1.241808
H  1.733876 0.330656 -1.623101
H  -3.673279 0.103705 1.516316
H  -3.541282 -1.63042 1.166899
H  -5.963352 -0.896429 1.118785
H  -5.58814 0.300421 -0.154698
H  -5.456101 -1.445751 -0.504746
H  3.130892 -0.47643 0.949592
H  3.505191 -1.04204 -0.718566
H  0.542575 2.837997 -0.791598
H  2.276485 2.464398 -1.089944
H  4.209306 -2.7824 0.997561
H  2.526543 -2.848517 1.611895
H  2.892606 -3.413041 -0.045282
H  2.014536 4.464697 0.456027
H  1.088068 3.446836 1.606325
H  2.81523 3.100449 1.303709
