program: Gaussian 09
title: 000077206
version: EM64L-G09RevD.01
frameworkgroup: C1[X(C8H6Cl3NO)]
method: RPBEPBE
basis: SDD
operation: Freq
keyword: #p
keyword: freq=noraman
keyword: PBEPBE/SDD
title: #p freq=noraman PBEPBE/SDD
converged: YES YES NO NO
title: Mulliken charges:
elementType: Cl Cl Cl O N C C C C C C C C H H H H H H
charge: -0.013258 -0.028820 -0.070203 -0.210410 -0.453800 0.677737 -0.244297 -0.288413 -0.237349 -0.231852 -0.211597 0.265934 -0.657052 0.335194 0.262563 0.262883 0.243868 0.298887 0.299985
chargesum: 0.00000
title: Mulliken charges with hydrogens summed into heavy atoms:
elementType: Cl Cl Cl O N C C C C C C C C
charge: -0.013258 -0.028820 -0.070203 -0.210410 -0.118606 0.677737 -0.244297 -0.288413 0.025215 0.031031 0.032271 0.265934 -0.058180
polarizability: 1.56100194e+02 -7.25327705e-01 1.40613147e+02 2.08515919e+00 -4.61230110e+00 7.00079380e+01
1716.lowfreq: -7.3872 -5.1996 -0.0008 -0.0006 0.0021 3.4976 25.3433 58.6101 66.2704
frequency: 25.2677 58.6085 66.2511 75.5595 115.4765 150.0077 194.1430 206.0077 260.0629 295.2736 344.1162 379.0280 385.6498 480.8565 498.5384 514.5399 521.6592 572.5046 623.8280 662.5524 680.0760 718.3483 743.9900 774.4038 861.4774 893.6572 905.2266 940.9495 968.3877 1058.1096 1069.7054 1152.2799 1158.3408 1195.8007 1215.0361 1258.0353 1271.6782 1360.8609 1414.8476 1418.2910 1451.0543 1495.8982 1567.4255 1591.5455 1625.9896 3070.4115 3155.1024 3155.7315 3175.8264 3186.6909 3461.3718
redmass: 10.5325 9.0288 4.8424 4.6056 14.1037 15.8630 4.7970 14.2863 6.8608 6.0350 14.7565 10.8873 8.6271 5.6164 5.0918 5.2846 4.1851 2.6877 1.4380 5.1378 6.4157 4.6279 7.4753 1.3689 6.2069 1.3561 1.7755 6.0874 1.3365 4.0941 2.7321 1.1227 1.3450 1.5079 3.2188 1.1881 2.0658 9.1371 1.1961 1.9348 2.9950 2.2531 6.0793 8.1744 8.6079 1.0570 1.1088 1.0875 1.0931 1.0996 1.0766
irintensity: 0.1193 1.0979 1.3700 12.7258 1.6949 3.7224 0.3582 6.6137 1.0422 4.8074 10.9263 7.0591 6.8604 6.2414 5.3873 1.0038 5.6962 5.9546 61.3466 11.9707 51.9862 38.3136 105.5169 62.7266 2.0571 0.0654 9.7032 4.7432 0.6285 4.7033 13.4028 1.0931 5.1814 9.5004 21.6118 18.2582 18.7731 21.5676 59.4458 41.8945 23.4606 405.8958 43.6237 15.7428 148.2013 2.4900 0.4162 3.4573 0.7073 4.8106 94.2855
temp: 298.150 k
press: 1.00000 atm
elementType: 17 17 17 8 7 6 6 6 6 6 6 6 6 1 1 1 1 1 1
symmnumber: 1
zpe: 325542.6 jmol-1
zpe.correction: 0.123993 hartree
zpe.thermalcorrener: 0.136709 hartree
zpe.thermalcorrenthalpy: 0.137653 hartree
zpe.thermalcorrgfe: 0.082291 hartree
zpe.sumelectzpe: -1817.673401 hartree
zpe.sumelectthermal: -1817.660685 hartree
zpe.sumelectthermalent: -1817.659740 hartree
zpe.sumelectthermalfe: -1817.715102 hartree
dipole: 1.9753 0.9063 -1.3171
dipole: 2.5412
quadrupole: -79.6664 -97.9271 -102.1381
quadrupole: 3.5696 -2.3997 3.0978
quadrupole: 13.5775 -4.6833 -8.8942 3.5696 -2.3997 3.0978
hfenergy: -1817.7973934 hartree
pointgroup: C01 [X(C8H6Cl3N1O1)]
dipole: -0.8341949 -0.3916251 -0.3877142 debye
dipolederiv: -0.1475762 -0.1773303 0.0721827 -0.148002 -0.6211333 0.1438772 0.0413922 0.1642876 -0.0698071 -0.2911275 0.3098114 0.0119034 0.2395327 -0.5566008 0.0099753 0.0270352 -0.0132643 -0.0486555 -0.4250448 0.0367399 0.1274364 0.1760186 -0.2585848 -0.1978275 0.2747904 -0.1467205 -0.4179199 -0.62864 0.0708666 0.2427774 -0.2676175 -0.4728699 -0.2405527 -0.2509485 -0.3159158 -0.7577635 -1.3338115 -0.3239431 -0.1874973 -0.3680878 -0.4589896 -0.0838815 -0.2537761 -0.1241848 -0.5162481 0.7850047 0.2176583 0.0231167 0.0414057 -0.2966668 -0.0216686 -0.145216 -0.0424946 0.0694118 0.1438742 0.2526951 -0.1322989 0.250955 0.9285295 -0.2524622 -0.0006162 -0.2048197 0.0123165 0.3075184 -0.4818442 -0.0612372 -0.3972151 0.7970168 -0.0137187 -0.0824606 0.0197424 -0.0562364 -0.1066576 -0.1690073 0.0279162 -0.1055643 -0.192943 0.0577547 0.0293062 0.0695501 -0.1148209 -0.2004361 0.1545089 0.004511 0.117482 -0.167714 -0.0151819 -0.0089216 -0.0360679 -0.1065534 0.0561298 -0.0131664 -0.0473109 -0.0199936 0.1277201 -0.0248566 -0.046768 -0.0213992 -0.1282937 1.2900499 0.167904 -0.0671932 0.8784765 0.5500944 0.411599 0.6293137 0.4699341 0.8586919 0.0443113 -0.1041746 -0.095447 -0.3450769 0.3052176 0.3020169 -0.289001 0.2263031 0.5027845 0.3310568 -0.0042795 -0.0401507 -0.1087902 0.2101425 -0.0705409 -0.0344919 -0.0360458 0.2842677 0.0556824 0.0464865 0.009597 0.0688922 0.0099548 0.0051102 0.0115964 0.0075543 0.1649926 0.0820114 -0.033245 0.0156274 -0.048133 -0.0117881 0.02337 0.026937 0.0180022 0.1639254 -0.074582 -0.0145179 0.0462892 -0.0117029 0.0661766 0.0131154 0.0472104 0.0061691 0.1541233 0.0450685 0.0438849 0.0015116 0.0669189 0.0723576 -0.0361538 -0.0427869 -0.0202982 -0.0294991 0.0671684 0.0209529 0.0482664 -0.0194983 -0.0299195 -0.0099744 0.0674055 -0.0203324 0.035284 unknown
polarizability: 153.1932098|0.6072385|140.6163724|-15.8090202|4.1777225|72.9116969 unknown
InChI: InChI=1S/C8H6Cl3NO/c9-4-7(13)12-8-5(10)2-1-3-6(8)11/h1-3,12H,4H2
charge 0 multiplicity 1
19 atoms
Cl -0.689528 2.658949 -0.644393
Cl 0.015484 -2.859123 -0.09943
Cl 3.732512 -0.384854 -1.611957
O  1.50147 1.382311 1.299548
N  0.94058 0.004399 -0.522326
C  -0.45275 -0.109665 -0.258629
C  -1.323037 1.013053 -0.232427
C  -1.047529 -1.381151 -0.040548
C  -2.695849 0.884655 0.053416
C  -2.418548 -1.544955 0.220444
C  -3.240342 -0.397451 0.281501
C  1.818472 0.731921 0.265632
C  3.285762 0.760411 -0.16802
H  1.35531 -0.59835 -1.243252
H  -3.328683 1.775666 0.076095
H  -2.829379 -2.544359 0.385093
H  -4.307542 -0.504243 0.497845
H  3.92041 0.453184 0.674776
H  3.551287 1.776601 -0.495967
