program: Gaussian 09
title: 000077228
version: EM64L-G09RevD.01
frameworkgroup: C1[X(C12H16N2O3)]
method: RPBEPBE
basis: SDD
operation: Freq
keyword: #p
keyword: freq=noraman
keyword: PBEPBE/SDD
title: #p freq=noraman PBEPBE/SDD
converged: YES YES NO NO
title: Mulliken charges:
elementType: O O O N N C C C C C C C C C C C C H H H H H H H H H H H H H H H H
charge: -0.196530 -0.264240 -0.249073 -0.432183 0.022920 -0.563656 -0.358262 0.591110 -0.341212 -0.587305 -0.404824 0.201006 0.325753 -0.329082 -0.693270 0.214240 -0.785729 0.215078 0.208173 0.210483 0.204355 0.199454 0.195283 0.293529 0.244302 0.319898 0.213334 0.211251 0.219367 0.360405 0.246271 0.264372 0.244783
chargesum: 0.00000
title: Mulliken charges with hydrogens summed into heavy atoms:
elementType: O O O N N C C C C C C C C C C C C
charge: -0.196530 -0.264240 -0.249073 -0.071778 0.022920 -0.140406 0.056576 0.591110 0.053524 -0.293776 -0.160522 0.201006 0.325753 -0.009184 -0.049318 0.214240 -0.030303
polarizability: 2.39926792e+02 -8.04931048e+00 1.85178498e+02 1.62613342e+01 5.67231848e+00 9.27698179e+01
1716.lowfreq: -48.4403 0.0002 0.0005 0.0007 3.2541 5.3228 7.2107 23.3177 40.5039
frequency: -48.4347 22.9495 40.4224 53.1045 60.9982 84.0345 106.6049 111.1597 143.1192 153.2779 195.8997 213.6415 232.6234 236.0447 288.3622 318.0783 352.1957 374.5089 411.0874 417.8376 434.3774 512.5576 520.9722 572.8923 592.3645 651.8497 665.5295 688.9863 728.7992 732.1041 751.4018 789.1778 814.2205 865.1305 891.0787 893.8964 900.3951 920.9756 934.8295 939.3560 989.1274 1003.0022 1012.4944 1036.1868 1066.5107 1068.6579 1085.1481 1106.0716 1147.0183 1162.7531 1206.6306 1219.1260 1230.1314 1249.6237 1257.4387 1273.3250 1287.3418 1307.3167 1320.9630 1333.8707 1347.1552 1370.6613 1380.7628 1391.3222 1421.9682 1448.6203 1464.7626 1464.7799 1469.2835 1477.9955 1479.7905 1487.7203 1498.3690 1514.7148 1578.6939 1626.0343 1635.4099 2964.1251 2970.9369 2975.1589 2981.1702 2992.9549 3004.4623 3025.6262 3050.2330 3072.3392 3074.8195 3077.8982 3131.3592 3139.4044 3169.3978 3189.8216 3263.7209
redmass: 1.0542 3.7377 3.9746 11.6286 1.6230 3.8033 3.9973 2.8690 4.3619 5.3490 4.1304 2.2264 2.8936 1.6722 6.2760 4.0999 5.1029 4.0735 5.1343 3.7900 4.0256 4.6539 4.7999 3.7753 3.1007 5.3437 7.0287 6.5920 5.2922 1.0782 7.5116 1.1919 4.6582 1.5295 3.2009 1.1140 1.7458 1.3593 2.4231 2.2183 1.7043 1.3509 3.7317 1.6758 2.7281 2.5572 1.4659 2.1752 1.7077 3.2984 1.4915 1.8171 4.3281 1.6448 1.4887 1.2442 1.0702 2.3788 1.4640 4.7912 1.5695 2.9235 1.2543 1.2126 5.4602 1.1179 1.0464 1.0767 1.0771 1.0436 1.0724 1.0912 3.0530 2.8000 3.8318 5.5445 4.7489 1.0586 1.0594 1.0367 1.0608 1.0382 1.0985 1.1016 1.1040 1.1008 1.0994 1.0979 1.0911 1.0988 1.0916 1.0946 1.0798
irintensity: 0.8560 0.0272 0.0563 4.3954 0.0255 4.3323 1.3344 0.6654 10.2597 0.5932 0.1124 1.8363 0.4865 0.1325 0.6709 0.6241 1.6539 0.0701 2.5572 0.6829 0.1372 9.5473 7.0722 16.2675 5.8264 9.0932 8.1533 0.9162 2.5233 7.0899 5.3707 0.4351 1.1236 39.7329 3.6130 79.1394 4.6118 2.1290 6.4201 16.1304 38.7336 6.0957 4.2215 11.9750 0.2461 3.3517 5.8093 22.5571 132.5196 152.7861 0.7975 79.0750 120.3637 26.4410 3.8250 1.6405 1.2252 41.4157 14.1208 488.8787 6.7565 91.9457 80.9834 11.9520 13.0647 31.4705 19.3699 0.4096 1.3613 12.8169 3.4746 17.3974 63.3784 373.4224 288.8733 18.6542 63.0682 10.6935 13.0921 36.8147 78.9603 3.1977 2.9415 5.5077 29.6275 79.6468 53.4904 10.4456 12.8153 9.4342 3.8956 11.5832 111.7760
temp: 298.150 k
press: 1.00000 atm
elementType: 8 8 8 7 7 6 6 6 6 6 6 6 6 6 6 6 6 1 1 1 1 1 1 1 1 1 1 1 1 1 1 1 1
symmnumber: 1
zpe: 694558.1 jmol-1
zpe.correction: 0.264543 hartree
zpe.thermalcorrener: 0.281258 hartree
zpe.thermalcorrenthalpy: 0.282203 hartree
zpe.thermalcorrgfe: 0.218172 hartree
zpe.sumelectzpe: -800.725635 hartree
zpe.sumelectthermal: -800.708919 hartree
zpe.sumelectthermalent: -800.707975 hartree
zpe.sumelectthermalfe: -800.772006 hartree
dipole: -2.0946 -1.4862 -0.3222
dipole: 2.5884
quadrupole: -85.6674 -121.5036 -101.2494
quadrupole: 0.6602 3.1882 -0.9084
quadrupole: 17.1394 -18.6968 1.5574 0.6602 3.1882 -0.9084
hfenergy: -800.9901778 hartree
pointgroup: C01 [X(C12H16N2O3)]
dipole: 0.8118731 0.6118119 -0.0602068 debye
polarizability: 240.2688032|-5.1290009|185.0841531|-16.6494941|4.0225276|92.5221524 unknown
InChI: InChI=1S/C12H16N2O3/c1-3-4-5-10-6-7-11(13-9(2)15)12(8-10)14(16)17/h6-8,13H,3-5H2,1-2H3
charge 0 multiplicity 1
33 atoms
O  -0.621166 -3.40557 -0.28021
O  -2.601931 -2.372995 0.125487
O  -3.184275 2.555684 0.291543
N  -2.729089 0.243238 0.17555
N  -1.313238 -2.329103 -0.132999
C  2.980392 0.099432 -0.939195
C  3.813865 0.418589 0.334253
C  1.484194 0.123588 -0.680111
C  5.334963 0.423429 0.062509
C  0.741605 -1.058914 -0.538456
C  0.786393 1.358413 -0.533921
C  -0.649217 -1.026687 -0.255626
C  -1.353613 0.221288 -0.10431
C  -0.586277 1.415267 -0.255594
C  6.164042 0.74563 1.324295
C  -3.571243 1.354211 0.358727
C  -5.016648 0.962949 0.647801
H  3.283538 -0.892408 -1.32533
H  3.239457 0.84042 -1.721909
H  3.576836 -0.326199 1.120347
H  3.507307 1.405422 0.737068
H  5.637304 -0.565095 -0.339307
H  5.561819 1.164693 -0.731103
H  1.215755 -2.038723 -0.643406
H  1.338192 2.299578 -0.647801
H  -1.103941 2.36993 -0.14921
H  5.978304 0.002184 2.122001
H  5.902333 1.742097 1.727184
H  7.247602 0.743423 1.106259
H  -3.137416 -0.707709 0.250742
H  -5.448978 0.393847 -0.195656
H  -5.607394 1.87664 0.803554
H  -5.085376 0.329252 1.550924
