program: Gaussian 09
title: 000077279
version: EM64L-G09RevD.01
frameworkgroup: C1[X(C14H15NO4S2)]
method: RPBEPBE
basis: SDD
operation: Freq
keyword: #p
keyword: freq=noraman
keyword: PBEPBE/SDD
title: #p freq=noraman PBEPBE/SDD
converged: YES YES NO NO
title: Mulliken charges:
elementType: S S O O O O N C C C C C C C C C C C C C C H H H H H H H H H H H H H H H
charge: 0.983853 0.937740 -0.525894 -0.501462 -0.521433 -0.525361 -0.614610 -0.102927 -0.008562 -0.211474 -0.213362 -0.249611 -0.265102 0.456703 0.456818 -0.341907 -0.351868 -0.395683 -0.383142 -0.797023 -0.798411 0.337594 0.322418 0.318549 0.296722 0.291224 0.248591 0.247021 0.247738 0.246011 0.229149 0.240075 0.240188 0.235814 0.242417 0.229206
chargesum: 0.00000
title: Mulliken charges with hydrogens summed into heavy atoms:
elementType: S S O O O O N C C C C C C C C C C C C C C
charge: 0.983853 0.937740 -0.525894 -0.501462 -0.521433 -0.525361 -0.277016 -0.102927 -0.008562 0.110944 0.105187 0.047111 0.026122 0.456703 0.456818 -0.093316 -0.104846 -0.147945 -0.137131 -0.087611 -0.090974
polarizability: 3.58567806e+02 -7.59885073e+00 1.87175842e+02 1.91533916e+00 -2.91397150e-01 1.69572922e+02
1716.lowfreq: -17.3370 -10.1062 -3.7222 -0.0020 -0.0008 0.0018 4.1825 19.2141 22.3282
frequency: -17.0238 19.1944 22.0183 23.5578 32.6502 50.1841 61.4998 94.8957 106.3886 119.2794 124.3097 140.7966 160.3904 165.8078 208.5088 222.2954 238.2215 264.9546 279.2663 297.6501 306.8815 340.5597 358.0599 375.0142 378.8620 396.8672 405.8645 406.5780 419.7874 441.7178 469.2806 502.8778 509.4237 578.4698 582.1537 620.1403 620.3479 699.6623 705.2469 742.4460 774.7698 775.8299 809.6976 818.8829 824.0706 829.0380 843.1833 844.9528 932.2030 957.6764 961.7421 965.1361 980.8485 982.4673 984.4037 986.6700 993.7420 994.9110 1045.7398 1049.4794 1049.5038 1051.4734 1124.3439 1125.6841 1170.2740 1192.0404 1193.8453 1219.2007 1219.2398 1304.9020 1305.6275 1380.6607 1382.1842 1392.1562 1393.7304 1399.8188 1401.5012 1468.5181 1469.7918 1471.3463 1473.6414 1475.0240 1475.1849 1589.3261 1591.0644 1591.9578 1594.2309 2981.6278 2983.7119 3063.0978 3063.2876 3093.3487 3093.7712 3137.4161 3138.0510 3140.7457 3140.9359 3155.6876 3157.4918 3165.0622 3166.8289 3257.6758
redmass: 1.0296 1.2329 4.8738 2.8987 3.9501 5.1922 5.4816 6.0800 6.1867 6.7638 6.6337 6.0002 7.7378 9.4438 6.7264 7.6676 7.2822 6.4009 5.4031 4.7149 4.5639 4.0242 5.9494 3.5043 4.0103 9.3721 3.0620 2.8951 11.1803 6.9111 5.4973 3.3172 3.3569 6.0461 5.4920 6.9477 6.9532 3.2571 3.2510 1.7225 4.7805 5.0386 10.3605 3.9175 1.4187 1.6116 1.2503 1.2484 12.2090 3.2709 1.3218 1.8384 1.6908 1.4249 2.0711 2.5743 1.9715 1.9465 2.4358 1.5907 1.5924 2.4430 1.3080 1.3153 1.1453 1.1258 1.1276 3.1088 3.1405 1.2572 1.2556 5.2418 6.1711 2.6309 2.4439 1.3303 1.3363 1.0452 1.0740 2.1023 1.6021 1.2992 1.1914 6.7810 5.8182 6.0190 6.7534 1.0385 1.0375 1.0973 1.0957 1.0998 1.0991 1.0890 1.0891 1.0894 1.0893 1.0977 1.0970 1.0964 1.0963 1.0750
irintensity: 0.2976 0.6568 1.9879 2.8632 0.0309 1.1603 0.1130 3.5247 2.8437 0.7798 0.2878 0.9000 1.9681 1.9565 18.5298 1.8817 15.1277 0.2779 20.4544 3.5678 5.2001 17.7655 19.9439 1.3907 15.9476 12.9660 0.6407 2.1495 111.1497 17.9792 193.2286 117.5524 163.3621 35.9621 20.5468 2.9720 2.0584 5.7565 1.5790 36.4587 0.7055 9.8070 57.9559 123.8385 34.7482 71.8307 0.8344 1.9245 39.8667 72.6481 1.5110 13.7154 0.4416 0.7296 1.7277 1.2658 4.8891 7.0440 27.9107 14.8785 18.8923 25.3385 7.8783 8.2013 1.0070 44.4871 2.6748 2.5267 5.1692 2.6144 3.3575 5.2076 3.3356 14.1114 12.1747 15.0981 14.4106 14.3929 16.5221 43.9098 22.7696 12.1738 24.7891 6.5637 5.7856 14.4833 0.1444 24.7247 22.9053 14.2152 16.6169 16.1025 17.7413 12.1149 12.7700 7.6728 5.6665 21.2298 18.3132 15.9667 10.7072 19.6231
temp: 298.150 k
press: 1.00000 atm
elementType: 16 16 8 8 8 8 7 6 6 6 6 6 6 6 6 6 6 6 6 6 6 1 1 1 1 1 1 1 1 1 1 1 1 1 1 1
symmnumber: 1
zpe: 682425.1 jmol-1
zpe.correction: 0.259922 hartree
zpe.thermalcorrener: 0.281927 hartree
zpe.thermalcorrenthalpy: 0.282872 hartree
zpe.thermalcorrgfe: 0.205751 hartree
zpe.sumelectzpe: -1692.373367 hartree
zpe.sumelectthermal: -1692.351362 hartree
zpe.sumelectthermalent: -1692.350418 hartree
zpe.sumelectthermalfe: -1692.427538 hartree
dipole: 0.8444 -0.9652 -1.1072
dipole: 1.6942
quadrupole: -76.1267 -156.1799 -140.8487
quadrupole: -7.8354 2.5071 -1.2269
quadrupole: 48.2584 -31.7948 -16.4636 -7.8354 2.5071 -1.2269
hfenergy: -1692.6332893 hartree
pointgroup: C01 [X(C14H15N1O4S2)]
dipole: 0.3386801 -0.3599071 -0.4472993 debye
polarizability: 358.6924397|-5.7683342|187.0251484|2.6808485|0.3367458|169.598982 unknown
InChI: InChI=1S/C14H15NO4S2/c1-11-3-7-13(8-4-11)20(16,17)15-21(18,19)14-9-5-12(2)6-10-14/h3-10,15H,1-2H3
charge 0 multiplicity 1
36 atoms
S  0.947743 1.435163 0.594481
S  -0.939923 -1.311839 0.557498
O  0.136827 1.738981 -0.774723
O  1.193832 2.582922 1.715724
O  -1.069826 -2.471629 1.693893
O  -0.132612 -1.603607 -0.82371
N  -0.150387 0.153831 1.529928
C  2.628578 0.653032 0.211857
C  -2.64557 -0.62256 0.183527
C  2.722193 -0.310988 -0.80639
C  -2.771677 0.38779 -0.782801
C  3.723174 1.119037 0.957579
C  -3.720876 -1.178799 0.891461
C  5.150972 -0.40673 -0.354906
C  -5.209314 0.32049 -0.383304
C  4.003612 -0.835425 -1.07776
C  -4.075386 0.853003 -1.055804
C  4.991874 0.572729 0.659747
C  -5.013095 -0.69367 0.590219
C  6.515789 -0.989399 -0.669861
C  -6.602604 0.822504 -0.712631
H  0.450646 -0.305795 2.260055
H  1.835132 -0.657564 -1.346108
H  -1.892786 0.816025 -1.27586
H  3.587987 1.884544 1.728354
H  -3.552069 -1.958196 1.641138
H  4.109745 -1.59433 -1.861349
H  -4.209788 1.649194 -1.796754
H  5.866382 0.917242 1.222617
H  -5.87641 -1.107694 1.122747
H  7.299801 -0.567486 -0.019253
H  6.519685 -2.087311 -0.538412
H  6.801521 -0.788372 -1.719125
H  -6.621586 1.922313 -0.812387
H  -6.954632 0.402562 -1.674512
H  -7.333051 0.535729 0.062526
