program: Gaussian 09
title: 000077163
version: EM64L-G09RevD.01
frameworkgroup: C1[X(C8H19NO2)]
method: RPBEPBE
basis: SDD
operation: Freq
keyword: #p
keyword: freq=noraman
keyword: PBEPBE/SDD
title: #p freq=noraman PBEPBE/SDD
converged: YES YES NO NO
title: Mulliken charges:
elementType: O O N C C C C C C C C H H H H H H H H H H H H H H H H H H H
charge: -0.252779 -0.281150 -0.079148 -0.424195 -0.021983 -0.603544 -0.632065 -0.218067 -0.209542 -0.691548 -0.682988 0.207172 0.242785 0.208278 0.223091 0.188935 0.222844 0.216051 0.184078 0.261110 0.232444 0.203921 0.187958 0.215237 0.201191 0.219219 0.227379 0.203801 0.225852 0.225665
chargesum: 0.00000
title: Mulliken charges with hydrogens summed into heavy atoms:
elementType: O O N C C C C C C C C
charge: -0.252779 -0.281150 -0.079148 0.025762 0.186295 0.031325 0.029174 0.218298 0.193652 -0.043760 -0.027670
polarizability: 1.18355876e+02 1.20088575e+00 1.02547461e+02 8.98785533e-02 -1.33517561e+00 8.99919431e+01
1716.lowfreq: -11.3088 -4.7191 -0.0012 -0.0012 -0.0011 12.8884 46.1699 46.6997 67.5843
frequency: 45.7980 46.4283 67.5129 72.0725 99.8724 111.8678 156.0838 191.4424 222.4188 235.8075 242.6582 250.5576 257.5080 298.9245 304.5951 334.6334 355.0952 411.4192 459.3251 592.9426 638.7502 766.4301 799.5398 812.3174 826.7419 858.4996 891.2423 956.9775 1019.9732 1029.8379 1036.4827 1048.3836 1060.8780 1086.8321 1100.1703 1112.4842 1125.9266 1137.5650 1139.4612 1141.7286 1194.3015 1246.6877 1255.7880 1260.7642 1270.2247 1300.2995 1350.9508 1357.0396 1367.1341 1384.2985 1392.1874 1398.0531 1418.0939 1440.9039 1459.2636 1459.7791 1460.7948 1462.9358 1472.5568 1479.5978 1481.6151 1482.8966 1487.6380 1492.5770 1497.5627 2843.6096 2847.3001 2864.3001 2941.2621 2970.3590 2979.2034 2988.4258 2991.6249 3014.8032 3016.0269 3031.1291 3032.7458 3035.8447 3075.7672 3085.2878 3088.7903 3089.9973 3095.6666 3098.2862
redmass: 2.5402 2.6442 2.5916 2.2287 2.7835 1.9876 2.8226 2.4921 2.1960 1.1808 1.2951 1.2496 1.2442 2.7892 3.3944 2.3205 3.0585 2.9149 2.4647 4.3274 2.9072 3.1308 3.4825 1.1456 1.0945 2.9940 2.6339 5.1608 2.1100 2.1707 1.5493 3.0318 2.6313 1.4997 1.9947 2.0570 2.1260 1.4380 1.4658 1.6235 2.1304 1.1566 1.1693 1.6204 2.2502 1.2855 1.2331 1.3338 1.2401 1.3456 1.2659 1.3281 1.1473 1.1702 1.0562 1.0471 1.0411 1.0588 1.0704 1.0507 1.0506 1.0450 1.0521 1.0806 1.0879 1.0571 1.0662 1.0616 1.0619 1.0563 1.0849 1.0361 1.0360 1.0998 1.0721 1.0742 1.1018 1.0896 1.1011 1.0987 1.0989 1.1008 1.1014 1.1011
irintensity: 0.2313 0.1674 0.9780 1.7571 2.0048 2.7053 8.1659 1.1386 1.1166 0.4951 0.5595 2.1606 0.6578 5.0125 5.9513 1.6431 17.7123 1.6179 0.8271 8.2681 2.5501 11.4869 16.2358 8.6465 4.8189 13.0620 66.4606 194.7333 8.0866 42.1085 10.1327 148.4619 54.9487 25.0591 18.9326 1.9410 47.3113 8.8339 3.0580 6.0968 1.8308 1.7163 1.6248 21.6715 9.9463 15.4850 3.8526 6.1312 1.1235 5.0894 22.0918 21.3544 2.8552 1.1941 5.6548 13.6578 11.9205 12.5870 8.2351 10.8555 5.0311 5.8861 31.8420 4.6123 0.5181 72.5864 62.7738 232.1829 56.1719 36.0496 54.2913 27.8942 26.7826 26.1845 44.3240 42.6209 18.7767 25.8179 34.4410 36.8229 39.6646 31.3531 42.2122 42.6115
temp: 298.150 k
press: 1.00000 atm
elementType: 8 8 7 6 6 6 6 6 6 6 6 1 1 1 1 1 1 1 1 1 1 1 1 1 1 1 1 1 1 1
symmnumber: 1
zpe: 695697.6 jmol-1
zpe.correction: 0.264977 hartree
zpe.thermalcorrener: 0.279658 hartree
zpe.thermalcorrenthalpy: 0.280602 hartree
zpe.thermalcorrgfe: 0.222977 hartree
zpe.sumelectzpe: -520.458519 hartree
zpe.sumelectthermal: -520.443839 hartree
zpe.sumelectthermalent: -520.442895 hartree
zpe.sumelectthermalfe: -520.500520 hartree
dipole: 0.2221 -0.6579 -0.0335
dipole: 0.6952
quadrupole: -63.1016 -69.4745 -69.2165
quadrupole: -1.6502 -1.7927 -3.7224
quadrupole: 4.1626 -2.2103 -1.9522 -1.6502 -1.7927 -3.7224
hfenergy: -520.7234966 hartree
pointgroup: C01 [X(C8H19N1O2)]
dipole: 0.0957299 -0.2535346 -0.0368318 debye
polarizability: 118.2613397|1.6916117|102.7791303|0.2881761|-0.1424909|89.8548107 unknown
InChI: InChI=1S/C8H19NO2/c1-5-10-8(11-6-2)7-9(3)4/h8H,5-7H2,1-4H3
charge 0 multiplicity 1
30 atoms
O  -0.306475 0.91862 0.749872
O  -1.444872 -0.894781 -0.384587
N  2.220033 -0.330247 -0.121655
C  0.919185 -0.902705 -0.525981
C  -0.2626 -0.483178 0.372399
C  3.280486 -0.688446 -1.084756
C  2.598624 -0.639499 1.272059
C  -0.16933 1.880831 -0.371133
C  -2.68765 -0.870111 0.416559
C  -0.436351 3.270136 0.206645
C  -3.834157 -1.275605 -0.50811
H  0.929186 -2.023219 -0.537165
H  0.696261 -0.575505 -1.558632
H  -0.248919 -0.997972 1.355555
H  2.992595 -0.354696 -2.098338
H  3.486879 -1.788787 -1.131798
H  4.220326 -0.177454 -0.809155
H  3.582173 -0.186259 1.489486
H  2.672467 -1.73901 1.47616
H  1.864171 -0.197226 1.965309
H  0.858152 1.801561 -0.775806
H  -0.901299 1.624809 -1.163583
H  -2.586581 -1.580533 1.266495
H  -2.836623 0.146296 0.8315
H  -0.335424 4.039626 -0.581113
H  -1.45521 3.331757 0.628117
H  0.284451 3.497717 1.011191
H  -4.790811 -1.284348 0.045938
H  -3.923124 -0.565617 -1.34867
H  -3.660962 -2.283052 -0.924802
