program: Gaussian 09
title: 000077143
version: EM64L-G09RevD.01
frameworkgroup: C1[X(C10H14N2O3)]
method: RPBEPBE
basis: SDD
operation: Freq
keyword: #p
keyword: freq=noraman
keyword: PBEPBE/SDD
title: #p freq=noraman PBEPBE/SDD
converged: YES YES NO NO
title: Mulliken charges:
elementType: O O O N N C C C C C C C C C C H H H H H H H H H H H H H H
charge: -0.424980 -0.424901 -0.257724 -0.142441 -0.017152 -0.447899 -0.445295 0.447222 -0.321255 -0.321784 -0.332077 -0.309811 -0.333699 -0.314150 0.128435 0.226674 0.254259 0.226327 0.254113 0.227457 0.219658 0.227469 0.219709 0.226944 0.225183 0.254570 0.270388 0.342562 0.342199
chargesum: 0.00000
title: Mulliken charges with hydrogens summed into heavy atoms:
elementType: O O O N N C C C C C C C C C C
charge: -0.082418 -0.082702 -0.257724 -0.142441 -0.017152 0.033034 0.035145 0.447222 0.125860 0.125394 -0.105133 -0.084628 -0.079129 -0.043763 0.128435
polarizability: 2.51651727e+02 2.27006096e+00 1.33761155e+02 2.16467178e+00 1.56012524e+01 7.99943378e+01
1716.lowfreq: -4.6008 -0.0009 -0.0007 -0.0005 6.1742 12.0274 40.9686 46.4812 59.9670
frequency: 40.8004 46.4772 59.9089 67.6313 102.2873 120.1555 129.0000 179.5745 191.2779 231.1373 273.7025 291.2966 300.7709 307.3515 308.4472 339.8430 376.9927 397.2346 431.3643 483.9667 511.3820 594.5193 610.3709 634.2617 731.2465 732.5526 800.2823 803.8762 806.0992 821.0646 822.7829 957.3936 964.9716 968.8339 973.4017 981.3756 984.9763 1021.4200 1023.2909 1036.1390 1070.6337 1114.7714 1125.0077 1129.8618 1189.7269 1216.9493 1219.5957 1279.3061 1291.3710 1292.4817 1302.1348 1305.4919 1314.1956 1347.1242 1354.9318 1379.3095 1381.3127 1384.3486 1395.3113 1458.8589 1473.0029 1476.3631 1487.8803 1497.4068 1513.9060 1552.9562 1621.1755 2982.0886 2984.2633 2997.7923 3002.3874 3058.0880 3063.8122 3086.1964 3088.2424 3140.3597 3144.4597 3162.6350 3171.9214 3565.6318 3565.7498
redmass: 5.9218 6.8919 5.5842 4.6467 2.9677 2.8038 2.2328 5.4950 6.8877 3.9002 3.5734 3.2548 1.2837 2.2359 1.7446 4.9650 3.4755 4.2405 3.3762 3.3053 2.5451 4.6655 5.9168 5.7922 3.8952 4.7557 1.2653 1.2164 1.2980 3.5886 1.6920 2.7190 1.4354 3.6158 5.2327 1.3392 2.8819 4.6651 4.3175 1.6186 1.4055 1.6439 1.7409 1.4436 1.5707 1.6920 1.9099 1.4469 1.6344 1.6563 1.2994 1.1585 1.7474 1.2302 1.2008 2.2137 1.7321 1.3747 1.9609 2.7375 1.2494 1.0858 1.1170 1.5555 1.7145 6.9413 6.4773 1.0660 1.0655 1.0636 1.0630 1.0987 1.0968 1.1017 1.1028 1.0870 1.0880 1.0947 1.0948 1.0666 1.0666
irintensity: 0.8827 2.1595 9.0444 1.6458 4.2917 5.6689 1.8260 1.0945 2.5502 0.5534 42.0239 41.7714 6.8898 14.1015 194.7882 21.9831 2.5727 23.1334 1.0143 0.5634 11.8521 1.9766 4.6175 7.5157 0.1128 14.6077 6.8001 1.7324 5.0791 31.1189 82.4619 4.7788 10.9117 151.2821 129.7453 2.1093 2.1355 30.3613 23.3430 15.9911 15.0765 20.3490 189.8522 170.8770 74.5317 30.6249 44.7683 44.9431 123.8928 128.1731 50.9248 0.6992 86.1246 24.2546 26.9968 3.6719 10.3040 3.6469 44.5693 2.6578 5.2244 1.8821 28.8763 51.2241 77.5363 30.4328 338.0067 28.1990 23.8776 58.9115 37.7179 3.0900 5.6899 31.7088 27.5675 2.0893 2.5941 24.7078 17.9241 15.3033 14.2496
temp: 298.150 k
press: 1.00000 atm
elementType: 8 8 8 7 7 6 6 6 6 6 6 6 6 6 6 1 1 1 1 1 1 1 1 1 1 1 1 1 1
symmnumber: 1
zpe: 607993.1 jmol-1
zpe.correction: 0.231572 hartree
zpe.thermalcorrener: 0.247062 hartree
zpe.thermalcorrenthalpy: 0.248006 hartree
zpe.thermalcorrgfe: 0.187748 hartree
zpe.sumelectzpe: -723.391373 hartree
zpe.sumelectthermal: -723.375883 hartree
zpe.sumelectthermalent: -723.374939 hartree
zpe.sumelectthermalfe: -723.435198 hartree
dipole: -5.4775 -0.1373 -0.0848
dipole: 5.4799
quadrupole: -141.0702 -80.0493 -87.7370
quadrupole: 1.4682 0.4190 10.1291
quadrupole: -38.1181 22.9029 15.2152 1.4682 0.4190 10.1291
hfenergy: -723.6229456 hartree
pointgroup: C01 [X(C10H14N2O3)]
dipole: 2.1502523 -0.1253401 0.0941358 debye
polarizability: 251.1508704|-5.7118111|132.9225082|6.3153438|-17.6188145|81.3338416 unknown
InChI: InChI=1S/C10H14N2O3/c13-7-5-12(6-8-14)10-3-1-9(11-15)2-4-10/h1-4,13-14H,5-8H2
charge 0 multiplicity 1
29 atoms
O  3.199311 3.365553 0.084504
O  3.487697 -3.173809 0.008913
O  -4.948369 0.692531 -0.402148
N  1.412244 0.011651 0.008723
N  -4.269826 -0.332089 0.012105
C  2.148395 1.189161 -0.4964
C  2.240054 -1.091129 0.539078
C  0.019542 -0.052315 -0.001245
C  2.319402 2.299271 0.573866
C  2.536971 -2.188496 -0.516867
C  -0.677731 -1.231404 0.434269
C  -0.772231 1.06773 -0.44769
C  -2.075461 -1.278468 0.42682
C  -2.16544 1.007877 -0.462215
C  -2.840908 -0.167973 -0.021978
H  1.651237 1.596882 -1.397046
H  3.156415 0.867645 -0.812986
H  1.759025 -1.536927 1.430712
H  3.206836 -0.67811 0.877591
H  2.835957 1.892904 1.459266
H  1.333003 2.691455 0.895771
H  3.045325 -1.745531 -1.389336
H  1.597951 -2.664518 -0.865842
H  -0.123545 -2.111616 0.769831
H  -0.281742 1.98888 -0.774644
H  -2.614247 -2.173819 0.757035
H  -2.771207 1.856681 -0.799923
H  2.724971 3.908689 -0.594448
H  3.039471 -3.749309 0.678882
