program: Gaussian 09
title: 000077149
version: EM64L-G09RevD.01
frameworkgroup: C1[X(C14H14O4)]
method: RPBEPBE
basis: SDD
operation: Freq
keyword: #pfreq=noraman
keyword: PBEPBE/SDD
title: #p freq=noraman PBEPBE/SDD
converged: YES YES NO NO
title: Mulliken charges:
elementType: O O O O C C C C C C C C C C C C C C H H H H H H H H H H H H H H
charge: -0.489308 -0.489307 -0.435422 -0.435423 0.235123 0.235121 0.332899 0.332899 -0.526387 -0.526386 -0.543546 -0.543545 0.152425 0.152426 -0.840190 -0.840191 0.151380 0.151379 0.245317 0.245317 0.258450 0.258451 0.229259 0.239299 0.236544 0.236544 0.229258 0.239299 0.371792 0.371792 0.382366 0.382365
chargesum: 0.00000
title: Mulliken charges with hydrogens summed into heavy atoms:
elementType: O O O O C C C C C C C C C C C C C C
charge: -0.117516 -0.117516 -0.053056 -0.053057 0.235123 0.235121 0.332899 0.332899 -0.281070 -0.281068 -0.285096 -0.285095 0.152425 0.152426 -0.135088 -0.135089 0.151380 0.151379
polarizability: 2.38896518e+02 1.66712537e-04 1.37110193e+02 2.00558896e+00 1.12079760e-05 1.30545544e+02
1716.lowfreq: -6.5762 0.0003 0.0006 0.0009 5.5538 7.0931 19.0584 53.5655 54.0580
frequency: 18.9714 53.5440 54.0569 83.3695 93.4824 126.1585 134.3508 200.6467 201.0917 203.8377 260.4793 262.2519 272.4599 272.8461 280.9499 282.3833 305.4679 327.0580 391.9145 396.5562 434.3238 443.8278 451.1066 457.5494 485.0710 485.4669 525.9978 543.8479 580.1948 641.3105 659.5801 661.3589 708.0635 723.1640 724.7453 727.9487 774.3339 808.8797 844.4060 851.6211 873.1995 874.1746 939.2070 998.3471 1001.7237 1038.6981 1040.7268 1059.8427 1089.3320 1126.0890 1153.1013 1167.5916 1168.8503 1207.1547 1214.2788 1217.3242 1275.5322 1279.0075 1286.5402 1343.5654 1379.9702 1397.3648 1401.9047 1405.3985 1428.4668 1431.1915 1461.1415 1467.5220 1474.6334 1475.4307 1502.5514 1524.6643 1606.0522 1606.1692 1627.6543 1628.1027 2978.0017 2979.2284 3052.8108 3053.7807 3086.6440 3086.6882 3117.3412 3117.9321 3153.4606 3153.5547 3529.0056 3529.3123 3623.2868 3623.4510
redmass: 4.6302 6.0693 6.0417 1.0672 1.0732 3.7691 3.7646 4.3337 4.4953 5.2740 1.2860 1.4668 3.3425 2.4665 4.2719 3.8565 3.4101 4.1421 6.1681 6.1974 4.0525 2.9365 3.5909 5.1579 1.1195 1.1174 5.2213 3.7554 5.1217 6.7504 6.0062 6.0877 5.6308 6.0070 3.3809 3.2759 5.3227 3.4813 1.5386 1.5404 1.3988 1.4011 3.4933 1.5162 1.4668 1.5176 1.5195 4.1585 2.0694 1.8833 1.8352 1.3533 1.4747 1.9360 1.6677 1.6562 2.4433 1.8183 2.3171 5.5293 4.6531 1.2630 3.8069 1.3409 2.8840 3.1323 1.0474 1.0505 1.2786 1.1938 2.9603 3.9560 7.0412 6.9349 7.0335 6.9780 1.0374 1.0373 1.0967 1.0970 1.0992 1.0992 1.0914 1.0916 1.0921 1.0921 1.0648 1.0649 1.0666 1.0666
irintensity: 0.5128 0.9310 0.7334 0.5523 0.2559 0.7656 0.3579 4.0213 8.9925 4.1303 143.4796 110.8321 26.5571 47.8428 0.0101 1.3792 14.5737 1.9189 4.7620 0.6904 8.6113 23.3445 26.0362 9.1193 120.5704 110.4538 21.9723 2.7025 4.4273 8.4831 5.9368 0.2812 10.7261 0.1185 2.5187 0.0404 77.5998 13.2367 11.3803 8.6723 22.8614 24.6074 16.4886 70.9496 8.2717 9.3647 5.4745 115.2419 191.5933 61.6059 180.5436 0.4978 56.6496 11.0981 269.1718 0.0313 303.0608 10.5905 30.7411 13.1812 7.6287 8.8283 13.0163 6.5811 58.2537 12.5252 15.1421 22.4646 24.5726 11.2542 233.0379 18.5942 1.6737 72.5940 2.2933 12.7509 27.4215 33.1115 13.3068 18.8720 9.6837 48.9952 9.8680 10.2458 10.6953 2.5110 148.5229 28.9491 51.4565 50.0564
temp: 298.150 k
press: 1.00000 atm
elementType: 8 8 8 8 6 6 6 6 6 6 6 6 6 6 6 6 6 6 1 1 1 1 1 1 1 1 1 1 1 1 1 1
symmnumber: 1
zpe: 646053.3 jmol-1
zpe.correction: 0.246069 hartree
zpe.thermalcorrener: 0.264008 hartree
zpe.thermalcorrenthalpy: 0.264952 hartree
zpe.thermalcorrgfe: 0.200096 hartree
zpe.sumelectzpe: -841.480109 hartree
zpe.sumelectthermal: -841.462170 hartree
zpe.sumelectthermalent: -841.461226 hartree
zpe.sumelectthermalfe: -841.526082 hartree
dipole: 0.0000 -2.8309 -0.0001
dipole: 2.8309
quadrupole: -122.3177 -94.0670 -97.3036
quadrupole: -0.0002 12.4789 0.0000
quadrupole: -17.7549 10.4958 7.2591 -0.0002 12.4789 0.0000
hfenergy: -841.7261775 hartree
pointgroup: C01 [X(C14H14O4)]
dipole: 0.0000019 -1.1137571 -0.0001289 debye
polarizability: 238.8115975|-0.0008161|137.1101924|3.6354287|0.0008796|130.6304645 unknown
InChI: InChI=1S/C14H14O4/c1-7-3-11(15)13(17)5-9(7)10-6-14(18)12(16)4-8(10)2/h3-6,15-18H,1-2H3
charge 0 multiplicity 1
32 atoms
O  3.763293 -1.769894 1.378566
O  -3.763302 -1.769529 -1.379034
O  4.980834 -0.072104 -0.342038
O  -4.980848 -0.072176 0.341996
C  0.749242 0.019599 -0.059106
C  -0.749253 0.019584 0.059112
C  1.42543 0.8997 -0.95689
C  -1.425443 0.899454 0.957121
C  1.505231 -0.884283 0.734106
C  -1.505241 -0.884092 -0.734335
C  2.840657 0.852934 -1.036759
C  -2.840671 0.852674 1.036969
C  2.906677 -0.914234 0.640715
C  -2.906688 -0.914064 -0.640958
C  0.652834 1.873507 -1.831569
C  -0.652849 1.873023 1.832067
C  3.584845 -0.042685 -0.247786
C  -3.584857 -0.04274 0.247761
H  0.980328 -1.558558 1.422928
H  -0.980339 -1.558192 -1.423329
H  3.383342 1.515233 -1.718746
H  -3.383356 1.5148 1.719122
H  1.335713 2.47807 -2.452111
H  -0.045895 1.344741 -2.506308
H  0.037028 2.565993 -1.227608
H  -0.036969 2.565615 1.228303
H  -1.335735 2.477478 2.452707
H  0.045812 1.344069 2.506728
H  3.258566 -2.352845 1.993926
H  -3.258574 -2.352336 -1.99453
H  5.326533 -0.758668 0.287282
H  -5.326545 -0.758577 -0.287503
