program: Gaussian 09
title: 000077231
version: EM64L-G09RevD.01
frameworkgroup: C1[X(C12H32N2OSi2)]
method: RPBEPBE
basis: SDD
operation: Freq
keyword: #p
keyword: freq=noraman
keyword: PBEPBE/SDD
title: #p freq=noraman PBEPBE/SDD
converged: YES YES NO NO
title: Mulliken charges:
elementType: Si Si O N N C C C C C C C C C C C C H H H H H H H H H H H H H H H H H H H H H H H H H H H H H H H H
charge: 1.513897 1.513157 -1.017549 -0.569555 -0.569738 -0.837517 -0.834405 -0.321155 -0.323776 -1.049140 -1.050721 -1.053914 -1.045978 -0.347897 -0.347173 -0.390968 -0.391054 0.226010 0.219671 0.227497 0.218836 0.194646 0.203433 0.192131 0.205636 0.237766 0.234140 0.236164 0.239560 0.227997 0.244638 0.238244 0.231096 0.242270 0.232028 0.235719 0.240051 0.212565 0.177243 0.212351 0.177900 0.204497 0.174077 0.204107 0.174451 0.270464 0.258864 0.270419 0.259017
chargesum: 0.00000
title: Mulliken charges with hydrogens summed into heavy atoms:
elementType: Si Si O N N C C C C C C C C C C C C
charge: 1.513897 1.513157 -1.017549 -0.040227 -0.040303 -0.391836 -0.388072 0.076924 0.073991 -0.341070 -0.338527 -0.342304 -0.338179 0.041911 0.043079 -0.012394 -0.012497
polarizability: 2.26243274e+02 -4.78488229e-01 1.91985479e+02 -8.88567004e-02 1.86587288e+00 1.72356149e+02
1716.lowfreq: -11.0491 -7.0162 -0.0013 -0.0011 -0.0007 5.5481 9.5883 21.5285 23.9151
frequency: -6.6136 20.3972 23.7466 26.8216 43.5298 51.4188 64.4061 66.1163 70.2138 96.9134 104.6791 118.2895 123.0513 128.3164 131.5984 143.9113 147.2325 155.0340 157.6900 168.8791 172.3303 182.4788 183.0272 214.1474 225.4078 229.7698 241.2085 247.7886 287.7887 304.6794 334.2731 344.8989 355.8495 450.0431 456.3672 461.9883 594.4401 608.6842 612.5360 637.8299 686.5416 690.9781 694.4870 695.5368 714.5363 716.5295 757.0042 759.3641 799.2208 800.1565 814.4824 818.7604 853.5369 858.8484 883.6024 901.0382 904.7263 916.1157 957.6244 957.8568 1004.2513 1005.5443 1022.0651 1028.3485 1033.4268 1063.4884 1064.8835 1089.3342 1091.5634 1114.5498 1115.6875 1181.1889 1183.5976 1220.4116 1221.0518 1247.8311 1249.5997 1280.5400 1284.4153 1289.6206 1290.5769 1292.9320 1293.7614 1295.7803 1299.4256 1300.2335 1302.9176 1340.4839 1343.2153 1384.0475 1384.7573 1428.8918 1429.0451 1441.4034 1443.2989 1444.2706 1445.1243 1449.5489 1450.7555 1456.5095 1457.7636 1461.6940 1465.2597 1474.1998 1477.5940 1491.3301 1492.7498 1636.6620 1636.8997 2841.0034 2842.5970 2954.9182 2955.4683 2959.6425 2960.4985 2968.3010 2968.7714 2977.1918 2978.7118 2980.2647 2982.2353 3001.3019 3002.1253 3005.4627 3005.6781 3025.2177 3026.2587 3046.4478 3047.9379 3079.3266 3080.2031 3082.7879 3084.0792 3085.1594 3087.1769 3087.8059 3091.4688 3449.4466 3449.6811 3577.2422 3577.4321
redmass: 3.4174 3.4124 3.9307 3.3864 2.6830 2.1380 2.3257 2.8341 3.3260 2.2836 2.5107 1.0518 1.0938 1.9076 1.7373 2.7072 2.2313 1.2087 1.1373 2.5519 2.5482 2.4386 2.3824 2.7665 3.1513 2.3317 1.2338 1.2417 4.1174 3.9432 4.3544 3.1916 3.1309 4.3468 3.2193 3.2600 1.3034 1.2780 3.4687 2.9592 1.5319 1.7034 2.7314 2.6341 1.8044 1.7261 1.1421 1.1493 1.2660 1.2575 1.6363 1.5967 1.4337 1.3652 1.3817 1.5671 1.5370 1.5958 1.9613 1.9542 3.4079 3.8141 1.5114 1.3903 9.2783 2.4968 2.4715 2.1047 2.1592 1.8059 1.7974 1.3394 1.3383 1.5091 1.5045 1.3078 1.3008 1.0559 1.0593 1.1795 1.2229 1.1902 1.2197 1.3071 1.2077 1.2036 1.2004 1.4684 1.4626 1.4593 1.4555 1.0782 1.0783 1.0547 1.0539 1.0532 1.0539 1.0497 1.0496 1.0494 1.0492 1.0698 1.0695 1.0930 1.0890 1.0906 1.0882 1.0944 1.0942 1.0715 1.0716 1.0632 1.0632 1.0594 1.0597 1.0598 1.0600 1.0344 1.0344 1.0343 1.0345 1.0935 1.0904 1.0889 1.0894 1.1002 1.1001 1.1022 1.1018 1.0978 1.0979 1.0974 1.0979 1.0983 1.0985 1.0981 1.0981 1.0447 1.0447 1.0975 1.0975
irintensity: 0.0515 0.0935 0.1356 0.3274 2.5330 6.5657 0.3364 0.0130 0.7959 3.2381 0.6643 0.0830 0.0411 1.3587 0.0444 0.0588 1.7799 0.2022 0.3898 0.8918 1.3885 1.1025 0.3882 8.2331 4.2962 7.8957 53.6947 41.2406 22.1610 6.6317 70.8848 0.8614 11.0111 0.4233 23.4022 5.1143 486.8575 20.6184 3.4299 8.6753 9.5880 0.0734 14.2541 17.4638 21.7138 18.6117 4.8003 4.3953 0.8824 0.3590 25.9469 86.2701 87.1694 3.2722 101.1560 53.1809 186.7535 36.0627 7.7650 6.8112 6.0833 29.5970 4.0892 7.1129 683.6846 0.6911 0.1926 8.9229 0.3203 5.1701 47.8077 6.0287 38.1497 3.7788 6.1706 2.9442 5.2607 2.8532 3.2146 25.0004 17.2137 50.6371 14.7173 8.1787 6.1036 49.2621 28.8158 1.1343 1.1519 10.2107 23.0567 8.4517 1.4236 11.4715 0.8577 1.1950 1.7675 4.7572 8.7708 0.8148 26.5124 0.1922 5.8115 1.3020 9.2706 4.2628 2.1144 42.4280 32.8881 278.8096 43.4000 5.5431 2.7899 1.7581 3.8358 129.5743 11.8390 17.2781 17.1466 11.8485 11.3783 13.3743 2.1995 53.3667 7.0697 2.7860 1.7627 221.1322 9.2119 15.4395 0.2925 53.1892 16.9107 21.9767 13.2590 26.5993 21.3852 1.9607 2.3089 0.1851 0.2070
temp: 298.150 k
press: 1.00000 atm
elementType: 14 14 8 7 7 6 6 6 6 6 6 6 6 6 6 6 6 1 1 1 1 1 1 1 1 1 1 1 1 1 1 1 1 1 1 1 1 1 1 1 1 1 1 1 1 1 1 1 1
symmnumber: 1
zpe: 1120500.8 jmol-1
zpe.correction: 0.426776 hartree
zpe.thermalcorrener: 0.453707 hartree
zpe.thermalcorrenthalpy: 0.454652 hartree
zpe.thermalcorrgfe: 0.367336 hartree
zpe.sumelectzpe: -1238.627549 hartree
zpe.sumelectthermal: -1238.600618 hartree
zpe.sumelectthermalent: -1238.599674 hartree
zpe.sumelectthermalfe: -1238.686990 hartree
dipole: -0.3261 0.0040 0.0205
dipole: 0.3267
quadrupole: -113.8404 -137.9852 -121.1967
quadrupole: -0.1833 0.9885 -1.0278
quadrupole: 10.5003 -13.6444 3.1440 -0.1833 0.9885 -1.0278
hfenergy: -1239.0543256 hartree
pointgroup: C01 [X(C12H32N2O1Si2)]
dipole: 0.040189 -0.1220921 -0.0018388 debye
polarizability: 195.4891908|-10.645487|222.2418184|1.3074289|4.6115423|172.8538938 unknown
InChI: InChI=1S/C12H32N2OSi2/c1-16(2,11-7-5-9-13)15-17(3,4)12-8-6-10-14/h5-14H2,1-4H3
charge 0 multiplicity 1
49 atoms
Si -2.243647 1.620692 -0.426164
Si 0.773405 2.53492 0.791848
O  -0.623039 1.862536 0.067525
N  -1.524694 -5.105039 -0.501657
N  4.336883 -3.149872 -0.076613
C  -2.701839 -0.195126 -0.017789
C  2.266077 1.469606 0.236406
C  -1.809333 -1.248978 -0.721538
C  2.160421 -0.025622 0.629123
C  -3.379579 2.828632 0.524295
C  -2.332442 1.952083 -2.302876
C  0.557245 2.475362 2.689471
C  0.975143 4.338124 0.195525
C  -2.120399 -2.700124 -0.289269
C  3.332971 -0.881432 0.098067
C  -1.171239 -3.73503 -0.928029
C  3.187462 -2.378663 0.440488
H  -2.628945 -0.324133 1.08232
H  -3.767383 -0.365518 -0.2789
H  2.357048 1.557975 -0.866121
H  3.194356 1.907766 0.659534
H  -1.928263 -1.165705 -1.821964
H  -0.745129 -1.023099 -0.506479
H  2.114566 -0.119959 1.734188
H  1.204712 -0.433665 0.242343
H  -3.295972 2.671876 1.615497
H  -4.439211 2.685158 0.240431
H  -3.110027 3.878632 0.306681
H  -2.056532 2.998893 -2.526129
H  -3.350816 1.775065 -2.696672
H  -1.632913 1.294182 -2.849266
H  -0.321689 3.068494 3.002494
H  1.445302 2.884346 3.207126
H  0.407916 1.436454 3.035786
H  1.877619 4.805173 0.632736
H  0.101395 4.950528 0.485214
H  1.070185 4.376025 -0.905056
H  -3.161299 -2.968401 -0.555001
H  -2.046516 -2.771773 0.817423
H  4.294381 -0.519163 0.510891
H  3.396366 -0.76319 -1.005228
H  -1.271674 -3.684096 -2.029959
H  -0.115971 -3.442814 -0.688163
H  3.16626 -2.495201 1.541868
H  2.194099 -2.733865 0.061465
H  -1.025201 -5.848582 -0.99943
H  -1.492369 -5.23925 0.514579
H  4.372906 -4.124403 0.238154
H  4.458703 -3.073119 -1.091975
