program: Gaussian 09
title: 000077097
version: EM64L-G09RevD.01
frameworkgroup: C1[X(C13H12S2)]
method: RPBEPBE
basis: SDD
operation: Freq
keyword: #pfreq=noraman
keyword: PBEPBE/SDD
title: #p freq=noraman PBEPBE/SDD
converged: YES YES NO NO
title: Mulliken charges:
elementType: S S C C C C C C C C C C C C C H H H H H H H H H H H H
charge: 0.217921 0.217942 -0.200779 -0.201034 -0.821524 -0.228764 -0.229016 -0.243191 -0.242797 -0.210020 -0.209942 -0.207533 -0.207570 -0.228439 -0.228403 0.305508 0.302268 0.254840 0.254904 0.257537 0.257517 0.231380 0.231390 0.231820 0.231823 0.232081 0.232082
chargesum: 0.00000
title: Mulliken charges with hydrogens summed into heavy atoms:
elementType: S S C C C C C C C C C C C C C
charge: 0.217921 0.217942 -0.200779 -0.201034 -0.213748 0.026076 0.025887 0.014346 0.014720 0.021360 0.021447 0.024287 0.024253 0.003642 0.003679
polarizability: 2.28725513e+02 2.23205040e-02 1.43034124e+02 -7.98216472e-02 -1.15871465e+01 1.47117065e+02
1716.lowfreq: -21.9891 -2.3784 -0.0019 0.0018 0.0025 7.3953 12.1744 18.5277 19.4855
frequency: -21.5706 18.4053 19.2172 30.7175 60.6083 86.0384 180.5691 193.4275 238.2149 265.0744 267.1487 390.8192 405.8488 405.9094 420.2980 476.8260 487.8371 610.6165 610.7392 672.3609 672.6701 682.3622 683.9317 697.3073 700.8529 756.0033 764.1895 848.2698 851.6775 855.1150 928.5871 929.9161 979.7700 980.1387 985.3412 986.0505 998.6108 998.7279 1014.6182 1015.2610 1069.2282 1070.1517 1071.8507 1073.0231 1075.5760 1171.7285 1171.7527 1179.8055 1180.4387 1213.6450 1296.7887 1297.1974 1372.9277 1373.1206 1424.2934 1424.6260 1425.1329 1458.0991 1458.2219 1586.2300 1586.5386 1586.9972 1587.1916 3036.4090 3127.9669 3127.9966 3130.1161 3136.7518 3136.7964 3149.2402 3149.3269 3157.6916 3157.7718 3169.2948 3169.4464
redmass: 8.5458 3.9899 3.8909 5.7126 2.6793 5.9659 9.2902 4.7234 5.3614 5.4975 5.5756 10.7138 2.8467 2.8370 10.6499 3.6369 3.4208 6.4686 6.4672 6.3389 7.6893 7.4064 5.9495 2.1321 1.9487 1.5369 1.7393 1.2704 1.2404 1.2658 1.3744 1.3811 1.3985 1.3999 6.1674 6.1094 1.3199 1.3197 3.3806 3.3614 1.5071 1.5861 2.1572 2.3913 1.0994 1.0541 1.0542 1.1110 1.1133 1.1367 1.3262 1.3247 9.6397 9.7466 2.0808 2.0658 1.0779 2.1100 2.1143 6.3046 6.2967 6.0572 6.0525 1.0522 1.0848 1.0848 1.1142 1.0883 1.0883 1.0929 1.0929 1.0968 1.0968 1.1016 1.1016
irintensity: 0.0222 0.0356 0.0466 0.1963 2.5133 0.0575 0.4430 2.4801 1.4878 0.1067 0.4657 0.5354 0.0488 0.0245 0.1823 17.5291 13.0415 0.0154 0.2714 9.5614 28.9209 0.1285 0.0033 45.3094 65.1433 62.2018 39.8405 1.9144 0.0284 1.9297 3.2502 1.6312 0.0776 0.0714 10.4342 1.6845 0.0842 0.1122 22.7598 6.9862 0.0440 16.7521 3.8505 0.0838 0.1453 0.0076 0.0049 5.0615 0.0176 36.9549 0.0794 1.5484 0.0052 1.6199 0.4536 18.4460 0.6111 17.2910 30.5035 0.4565 2.9268 12.4476 1.9535 11.1321 0.6355 0.0589 6.6504 2.5846 6.6611 17.4690 14.3192 0.7649 46.5307 27.2907 12.3610
temp: 298.150 k
press: 1.00000 atm
elementType: 16 16 6 6 6 6 6 6 6 6 6 6 6 6 6 1 1 1 1 1 1 1 1 1 1 1 1
symmnumber: 1
zpe: 544142.1 jmol-1
zpe.correction: 0.207253 hartree
zpe.thermalcorrener: 0.220735 hartree
zpe.thermalcorrenthalpy: 0.221679 hartree
zpe.thermalcorrgfe: 0.162946 hartree
zpe.sumelectzpe: -1297.623796 hartree
zpe.sumelectthermal: -1297.610315 hartree
zpe.sumelectthermalent: -1297.609370 hartree
zpe.sumelectthermalfe: -1297.668103 hartree
dipole: 0.0015 3.8624 0.8375
dipole: 3.9521
quadrupole: -89.8251 -106.5852 -93.8682
quadrupole: 0.0089 -0.0077 -5.0377
quadrupole: 6.9344 -9.8257 2.8913 0.0089 -0.0077 -5.0377
hfenergy: -1297.8310492 hartree
pointgroup: C01 [X(C13H12S2)]
dipole: 0.0006161 1.3348365 0.7974286 debye
polarizability: 228.7254159|0.0599229|150.4623837|-0.1040099|-10.4600769|139.6889027 unknown
InChI: InChI=1S/C13H12S2/c1-3-7-12(8-4-1)14-11-15-13-9-5-2-6-10-13/h1-10H,11H2
charge 0 multiplicity 1
27 atoms
S  -1.533141 -1.689157 -0.98616
S  1.532772 -1.685872 -0.992508
C  -2.806274 -0.51058 -0.33721
C  2.806056 -0.508798 -0.341073
C  0.000034 -0.745476 -0.381745
C  -3.14891 0.640668 -1.085208
C  3.151824 0.641557 -1.088968
C  -3.462729 -0.791517 0.883834
C  3.459288 -0.789783 0.881704
C  -4.143492 1.521321 -0.600252
C  4.146431 1.521253 -0.60226
C  -4.462322 0.088956 1.360907
C  4.458648 0.089883 1.360716
C  -4.800782 1.246662 0.622259
C  4.800332 1.246658 0.622063
H  0.002321 -0.712716 0.717704
H  -0.001928 0.267237 -0.811895
H  -2.650411 0.834309 -2.041063
H  2.655554 0.835258 -2.045955
H  -3.1946 -1.691283 1.447145
H  3.189015 -1.689088 1.444742
H  -4.409028 2.412544 -1.179619
H  4.414493 2.411749 -1.181584
H  -4.973165 -0.130629 2.304941
H  4.966938 -0.129667 2.306134
H  -5.574924 1.927402 0.993664
H  5.5744 1.926708 0.994887
