program: Gaussian 09
title: 000077084
version: EM64L-G09RevD.01
frameworkgroup: C1[X(C9H20N2S)]
method: RPBEPBE
basis: SDD
operation: Freq
keyword: #p
keyword: freq=noraman
keyword: PBEPBE/SDD
title: #p freq=noraman PBEPBE/SDD
converged: YES YES NO NO
title: Mulliken charges:
elementType: S N N C C C C C C C C C H H H H H H H H H H H H H H H H H H H H
charge: 0.130691 -0.591155 -0.305905 -0.375647 -0.371327 -0.368205 -0.352389 -0.349313 -0.356330 -0.700780 -0.695700 -0.096081 0.193053 0.193649 0.189690 0.189961 0.193941 0.192962 0.188604 0.188074 0.214685 0.217411 0.195123 0.195130 0.257198 0.276949 0.209918 0.209937 0.215880 0.325736 0.330301 0.253942
chargesum: 0.00000
title: Mulliken charges with hydrogens summed into heavy atoms:
elementType: S N N C C C C C C C C C
charge: 0.130691 0.064882 -0.051963 0.011054 0.008323 0.018698 0.024289 0.082783 0.033923 -0.166634 -0.059965 -0.096081
polarizability: 1.88089581e+02 2.44284657e+00 1.23502610e+02 5.41656523e+00 -1.51960657e+00 9.05062107e+01
1716.lowfreq: -2.4689 -0.0019 -0.0014 0.0010 6.3411 19.2593 24.4606 37.7954 40.8794
frequency: 22.8774 37.7084 40.8735 47.5399 73.5801 94.0059 95.0897 114.9633 143.9835 149.4437 162.1719 188.3805 227.0113 288.9318 334.8359 361.6111 375.9181 431.6055 447.6789 464.4254 482.3618 575.5628 597.2569 711.0963 719.0628 724.6768 732.9076 754.2553 793.0819 854.4426 888.2791 929.4376 987.8498 1001.6605 1018.1124 1036.1714 1040.0730 1067.2655 1069.9579 1076.5232 1079.6793 1081.3461 1119.2691 1186.4905 1212.1579 1221.3509 1241.3464 1258.7963 1261.0853 1283.0542 1283.6728 1286.8815 1296.5296 1300.3061 1319.7830 1346.2689 1356.1261 1356.2930 1388.3899 1453.3825 1463.2064 1464.0066 1467.8741 1472.4247 1476.2933 1479.1777 1485.9435 1490.1404 1591.5308 1666.9243 2951.1512 2953.3488 2956.7339 2963.5066 2968.8945 2971.7970 2983.7345 2985.9040 2994.4906 3002.0091 3006.2587 3022.0035 3036.0067 3047.2770 3068.1482 3071.0789 3083.2273 3454.4816 3544.4839 3700.4860
redmass: 4.0178 4.1648 4.3029 1.9312 2.4657 2.0157 4.0966 2.0020 2.1649 1.9762 4.9128 4.0695 1.1238 3.3592 3.8630 1.2015 3.6117 4.1829 2.9271 1.4494 2.6940 3.7074 4.3057 5.4405 1.1759 1.0629 1.0809 1.1055 1.1633 1.2139 1.8862 1.2172 4.9183 1.1517 3.6642 1.3491 3.0509 2.3805 1.2105 2.4073 2.0220 2.1151 2.6089 1.7910 1.2428 1.4578 1.3937 1.3046 2.1155 1.0372 1.3297 1.1720 1.0808 1.1136 1.3571 1.4634 1.6624 1.5869 1.2172 1.0847 1.0717 1.0701 1.0696 1.0769 1.0426 1.0793 1.0888 1.0957 1.2114 5.1150 1.0588 1.0588 1.0591 1.0592 1.0589 1.0364 1.0593 1.0968 1.0991 1.0564 1.1018 1.1038 1.1043 1.1044 1.1007 1.0993 1.1085 1.0780 1.0447 1.1046
irintensity: 0.1040 0.5488 1.4113 0.5694 2.0265 0.0458 0.6046 0.8904 0.0757 0.1802 1.0176 1.0293 0.0000 1.6987 1.5603 74.3151 0.3080 33.8503 15.4175 151.9193 42.9858 51.8276 79.1220 4.0039 60.9584 17.0414 0.6755 4.5336 0.0835 1.7056 5.3485 0.0627 0.6549 0.8794 5.6612 158.1887 17.3769 5.8638 8.0180 0.0325 5.7716 1.2270 14.2358 0.2577 0.2644 0.3660 104.9508 4.4847 213.6952 0.8236 12.4084 0.3551 0.1226 0.0652 0.9520 1.9456 0.0545 0.3882 11.2128 6.0725 0.0510 0.4143 0.8040 1.4236 12.5029 1.3733 1.6365 28.5608 81.8970 269.9561 0.0974 1.5596 0.5361 16.1650 143.9796 37.9027 30.0262 0.1080 0.2718 28.9030 0.9304 0.0828 46.6964 100.3100 96.6677 54.3092 45.1916 8.4055 54.0809 34.7139
temp: 298.150 k
press: 1.00000 atm
elementType: 16 7 7 6 6 6 6 6 6 6 6 6 1 1 1 1 1 1 1 1 1 1 1 1 1 1 1 1 1 1 1 1
symmnumber: 1
zpe: 737602.0 jmol-1
zpe.correction: 0.280938 hartree
zpe.thermalcorrener: 0.297427 hartree
zpe.thermalcorrenthalpy: 0.298371 hartree
zpe.thermalcorrgfe: 0.234260 hartree
zpe.sumelectzpe: -861.518085 hartree
zpe.sumelectthermal: -861.501596 hartree
zpe.sumelectthermalent: -861.500652 hartree
zpe.sumelectthermalfe: -861.564763 hartree
dipole: -1.4260 -0.9277 0.5232
dipole: 1.7799
quadrupole: -83.0333 -87.2700 -84.6718
quadrupole: -10.3654 4.9279 -2.4062
quadrupole: 1.9584 -2.2783 0.3199 -10.3654 4.9279 -2.4062
hfenergy: -861.7990227 hartree
pointgroup: C01 [X(C9H20N2S1)]
dipole: 0.572625 0.3903801 0.1003458 debye
polarizability: 187.9130239|-0.7563905|122.1738429|-7.3540997|-6.4809847|92.0115354 unknown
InChI: InChI=1S/C9H20N2S/c1-2-3-4-5-6-7-8-12-9(10)11/h10H,2-8,11H2,1H3
charge 0 multiplicity 1
32 atoms
S  -3.538473 1.006657 -0.339867
N  -6.096344 0.654167 0.439715
N  -4.947004 -1.388578 0.445105
C  1.809292 0.437707 -0.1657
C  3.045536 -0.449909 0.101952
C  0.469466 -0.306008 0.036642
C  4.385425 0.293554 -0.098248
C  -0.759352 0.599958 -0.217328
C  5.623198 -0.590682 0.176272
C  -2.081969 -0.157646 -0.009918
C  6.95715 0.161083 -0.022225
C  -4.953958 -0.102144 0.244534
H  1.841878 1.322053 0.504489
H  1.857495 0.831063 -1.202502
H  2.996939 -0.843188 1.139104
H  3.014504 -1.33521 -0.567511
H  0.426067 -0.706901 1.070672
H  0.431422 -1.183278 -0.642357
H  4.438335 0.683611 -1.136418
H  4.416195 1.181228 0.568156
H  -0.715887 0.998611 -1.250267
H  -0.72235 1.47203 0.464626
H  5.593523 -1.476235 -0.491319
H  5.568323 -0.981994 1.212817
H  -2.156081 -1.00915 -0.710304
H  -2.175272 -0.524735 1.027088
H  7.026892 1.030935 0.658166
H  7.048542 0.538913 -1.058194
H  7.82561 -0.493642 0.176399
H  -6.064752 1.669408 0.468939
H  -6.953054 0.161234 0.685073
H  -4.081597 -1.887814 0.189411
