program: Gaussian 09
title: 000077066
version: EM64L-G09RevD.01
frameworkgroup: C1[X(C11H12O2)]
method: RPBEPBE
basis: SDD
operation: Freq
keyword: #pfreq=noraman
keyword: PBEPBE/SDD
title: #p freq=noraman PBEPBE/SDD
converged: YES YES NO NO
title: Mulliken charges:
elementType: O O C C C C C C C C C C C H H H H H H H H H H H H
charge: -0.281008 -0.250186 -0.578598 0.478032 -0.255128 -0.414065 -0.371324 -0.222881 -0.228507 -0.241216 0.269850 -0.210106 -0.474445 0.228351 0.209007 0.232893 0.242870 0.228303 0.239441 0.224553 0.223637 0.227490 0.247884 0.227684 0.247469
chargesum: 0.00000
title: Mulliken charges with hydrogens summed into heavy atoms:
elementType: O O C C C C C C C C C C C
charge: -0.281008 -0.250186 -0.141240 0.478032 0.220634 -0.185762 -0.131883 0.001672 -0.004869 -0.013727 0.269850 0.037778 0.000709
polarizability: 1.47742101e+02 -5.41339654e+00 1.27569576e+02 -9.68561421e+00 8.06291106e+00 8.65957134e+01
1716.lowfreq: -12.3781 -6.2652 -5.7895 -0.0009 -0.0005 -0.0004 12.4219 23.5142 42.4584
frequency: 10.7337 23.2705 42.4170 88.9993 133.8431 139.1093 203.0008 230.3702 280.4769 334.1809 390.5976 403.3728 450.0235 490.5875 507.7303 562.6716 617.5129 652.4484 704.2173 754.4587 767.0096 779.8828 797.1466 853.0938 888.8189 914.1025 955.0238 975.3974 984.7248 991.4810 994.3677 994.7603 1003.9643 1027.9789 1054.7933 1062.5253 1089.7365 1131.8138 1171.7357 1182.4222 1188.2025 1215.9764 1232.0734 1287.3860 1328.3301 1334.1565 1355.4630 1383.2213 1410.8787 1440.5368 1459.8337 1466.8330 1485.1892 1594.2124 1615.0762 1623.3215 1641.9331 2994.9963 3006.5533 3052.9532 3075.9109 3103.7606 3113.0403 3123.6154 3136.1422 3147.0169 3157.5991 3163.0915 3219.7677
redmass: 3.8995 5.7494 4.8754 4.0323 3.5162 3.2010 3.4477 3.1751 4.2815 2.3752 2.7059 2.8021 4.2213 3.9106 1.7857 2.9713 6.3034 3.5339 1.7490 3.0997 1.9158 3.4227 3.0070 1.2489 3.7217 1.4291 2.4770 1.3995 2.4591 3.2754 1.4823 1.4217 1.0728 2.1211 2.1735 1.6687 1.6561 4.1087 1.0583 1.1774 1.1207 2.1298 1.1918 1.4297 1.2659 1.5351 1.3564 7.4129 1.2228 2.1652 1.1092 1.0959 2.2717 6.0736 6.1551 11.4005 4.5503 1.0597 1.0591 1.1011 1.1071 1.0599 1.0872 1.0859 1.0916 1.0961 1.0957 1.1016 1.1157
irintensity: 0.0569 0.8692 1.6785 1.2927 2.4943 3.5110 5.1140 2.5678 7.4532 1.0659 2.2022 0.1764 3.5189 9.5231 0.2104 15.0514 0.2313 4.4319 57.1103 15.4384 33.0486 21.3706 8.2216 0.1677 17.2133 1.2650 9.4887 0.0782 12.3206 1.0855 3.4118 28.9089 54.1210 6.7380 21.2083 36.7630 10.2316 451.6098 0.2353 1.2391 0.2406 0.0889 4.9870 42.0436 0.8684 2.4844 11.1105 0.4727 74.0247 8.3380 14.0663 6.9256 18.0109 1.2204 6.4955 152.5561 19.2808 16.8030 31.6660 14.6087 34.1633 4.6602 9.5061 0.3250 19.2528 43.8498 4.1713 18.3877 7.7921
temp: 298.150 k
press: 1.00000 atm
elementType: 8 8 6 6 6 6 6 6 6 6 6 6 6 1 1 1 1 1 1 1 1 1 1 1 1
symmnumber: 1
zpe: 526344.2 jmol-1
zpe.correction: 0.200474 hartree
zpe.thermalcorrener: 0.212974 hartree
zpe.thermalcorrenthalpy: 0.213918 hartree
zpe.thermalcorrgfe: 0.158234 hartree
zpe.sumelectzpe: -575.847615 hartree
zpe.sumelectthermal: -575.835115 hartree
zpe.sumelectthermalent: -575.834171 hartree
zpe.sumelectthermalfe: -575.889855 hartree
dipole: 0.7052 0.7902 1.1450
dipole: 1.5598
quadrupole: -74.9365 -67.6581 -78.2524
quadrupole: -7.8440 -7.2703 -0.2431
quadrupole: -1.3208 5.9575 -4.6367 -7.8440 -7.2703 -0.2431
hfenergy: -576.0480886 hartree
pointgroup: C01 [X(C11H12O2)]
dipole: 0.2919926 0.2814944 0.4605131 debye
dipolederiv: -1.5227377 0.4070299 -0.304769 0.5637073 -0.601152 0.0794669 -0.4121258 0.0474493 -0.4434433 -0.7189544 0.0296725 -0.1381886 -0.070492 -0.6449289 -0.2512185 -0.3174448 -0.1930207 -0.5759252 -0.0537125 -0.0399825 -0.0157213 0.0383749 0.1223104 0.0042681 -0.0799849 -0.0223894 0.1191666 0.1643901 0.1447379 -0.0760095 0.2137212 0.0673686 -0.0430517 -0.1104584 -0.0116718 -0.0464082 0.7020337 -0.1845191 0.0193315 -0.450313 0.4605684 -0.082074 -0.0012735 0.0156369 0.2511211 -0.1681058 -0.0241781 -0.0368375 -0.0301851 0.038387 0.0747827 -0.0235759 0.1031017 -0.1028879 -0.0504797 -0.0381336 -0.1096464 -0.1009782 -0.1123675 0.063794 -0.1008269 0.0377844 -0.0565749 -0.0119209 -0.0122098 -0.1238029 -0.0288983 -0.034514 0.0540067 -0.1308827 0.0457894 -0.0144875 -0.089203 0.0093853 -0.0569535 0.0352788 0.0984987 0.0861783 -0.0509931 0.0764711 -0.0680044 -0.0599811 0.0919997 -0.079659 0.0856458 -0.0074357 -0.0248541 -0.0667428 -0.0188832 -0.1090819 1.6990021 -0.4300536 0.3967231 -0.496898 0.9716428 0.2314397 0.6329876 0.1948379 0.6813621 -0.3165288 0.2443418 0.1045692 0.2316649 -0.2614924 0.0637149 0.0551164 0.0905153 -0.0664124 -0.0177697 -0.1282101 0.0918819 -0.0206821 -0.0075833 0.1617587 0.1694625 0.0986049 -0.1218445 0.0425829 -0.038872 0.0537814 -0.056546 0.0685455 -0.0569428 0.0483046 0.0302939 -0.1158081 -0.0205221 0.0906427 -0.0007237 0.0263022 -0.1244884 0.0109352 0.0197884 -0.058865 0.0857876 -0.142436 -0.1090352 0.0331539 0.010884 -0.0981288 0.0446748 0.0404373 0.0325571 0.0668426 0.0214699 0.0591877 0.0089778 0.0991796 0.0198215 0.0370355 0.0497254 -0.0165038 -0.0898407 0.1258171 -0.0290486 0.0227096 -0.0108711 -0.1070987 -0.0790778 0.0248425 -0.0644553 0.0918833 0.0363218 0.0250253 0.1293315 0.036365 0.0779459 -0.0262582 0.1391539 -0.0369467 0.0344112 0.0002269 0.019912 0.1343343 0.0251494 0.0739349 -0.053275 0.1472462 -0.0474476 0.0191717 0.1102972 -0.0067019 0.0356519 -0.0300346 -0.1009182 -0.0868107 0.0328796 -0.0891803 0.0893762 0.0120041 -0.1115168 0.0806113 -0.1200397 -0.0094375 0.0328564 0.0873777 0.0335413 0.1034597 0.0761228 -0.033552 -0.0983718 0.000863 0.0500045 -0.0759285 -0.0692688 -0.0966737 0.0666008 0.0773102 0.0745311 -0.0067795 0.0911062 -0.0223605 -0.074522 -0.0019723 -0.077871 0.1177486 0.104773 -0.0104526 -0.0635948 -0.0423041 0.0828777 -0.0908985 -0.0817723 -0.0726745 0.0837874 unknown
polarizability: 147.152543|-5.2309019|126.9041877|-10.7273018|10.3836124|87.8506589 unknown
InChI: InChI=1S/C11H12O2/c1-2-11(12)13-9-8-10-6-4-3-5-7-10/h2-7H,1,8-9H2
charge 0 multiplicity 1
25 atoms
O  -1.447246 -0.362256 0.491644
O  -3.169763 -0.882399 -1.000708
C  0.577318 -1.676855 0.852791
C  1.596361 -0.647281 0.382324
C  -0.757347 -1.622298 0.092931
C  2.561837 -0.986911 -0.599926
C  1.587945 0.674997 0.896144
C  3.49465 -0.030595 -1.062344
C  2.519607 1.633542 0.438133
C  3.476593 1.284409 -0.543307
C  -2.667319 -0.107946 -0.149365
C  -3.236041 1.17731 0.333853
C  -4.423256 1.640326 -0.135586
H  0.365506 -1.553901 1.931291
H  0.984199 -2.697631 0.716951
H  -1.413191 -2.472302 0.357963
H  -0.61587 -1.616816 -1.002772
H  2.587142 -2.008003 -1.001933
H  0.842248 0.950814 1.650298
H  4.235378 -0.311603 -1.819675
H  2.500549 2.650718 0.846024
H  4.20072 2.027068 -0.896854
H  -2.64685 1.72195 1.078816
H  -4.848258 2.586966 0.213719
H  -4.984011 1.067199 -0.883314
