program: Gaussian 09
title: 000077271
version: EM64L-G09RevD.01
frameworkgroup: C1[X(C23H31N3O)]
method: RPBEPBE
basis: SDD
operation: Freq
keyword: #p
keyword: freq=noraman
keyword: PBEPBE/SDD
title: #p freq=noraman PBEPBE/SDD
converged: YES YES NO NO
title: Mulliken charges:
elementType: O N N N C C C C C C C C C C C C C C C C C C C C C C C H H H H H H H H H H H H H H H H H H H H H H H H H H H H H H H
charge: -0.457635 -0.094778 -0.091971 -0.284692 -0.356650 -0.366485 -0.379921 -0.372488 -0.335129 -0.425467 -0.426828 -0.315471 0.164632 0.225569 0.350878 0.385079 -0.524601 -0.599821 -0.334799 -0.325614 -0.330200 -0.374565 -0.433291 -0.273691 -0.251653 -0.273516 -0.253602 0.197404 0.187291 0.213276 0.184368 0.206331 0.184163 0.195989 0.194482 0.188855 0.208270 0.200547 0.241607 0.199622 0.264416 0.203009 0.217711 0.237604 0.217579 0.214781 0.210535 0.205324 0.192149 0.239848 0.247605 0.224345 0.233886 0.223697 0.224972 0.226131 0.225827 0.345088
chargesum: 0.00000
title: Mulliken charges with hydrogens summed into heavy atoms:
elementType: O N N N C C C C C C C C C C C C C C C C C C C C C C C
charge: -0.112547 -0.094778 -0.091971 -0.284692 0.028045 0.031158 0.010572 0.017983 0.061997 0.016687 0.037211 0.105249 0.164632 0.225569 0.350878 0.385079 -0.069419 -0.174505 0.062674 -0.085765 -0.082595 -0.150220 -0.199405 -0.049994 -0.026681 -0.047386 -0.027774
polarizability: 3.10345541e+02 -4.98145933e+01 2.77367564e+02 -2.79212160e+01 -1.59486358e+01 2.22014049e+02
1716.lowfreq: -15.7970 -3.4052 -0.0006 -0.0003 0.0008 4.8109 9.9251 12.1387 30.1793
frequency: 1.9438 8.9429 30.0927 30.8014 48.3832 56.5545 60.5674 70.1283 94.9070 110.7045 125.9254 152.3135 159.9389 185.9488 226.3476 251.6466 262.0789 262.8727 277.3137 289.8692 298.7466 309.8500 321.1186 331.3186 351.6879 370.4064 375.5761 406.4827 420.0132 436.5452 455.7535 462.0728 481.0203 483.8045 500.6409 521.8400 542.4752 560.2820 579.0899 589.6334 608.4571 618.3130 668.1050 714.6406 732.3346 743.0564 752.7166 763.2790 767.5165 775.7425 783.3820 816.7857 833.1756 845.2100 851.9190 864.3628 869.7040 874.5416 920.6404 927.6726 935.4492 941.0998 967.2898 969.8579 973.2009 975.7000 978.7407 996.4686 997.8042 1030.6337 1037.2373 1044.3470 1044.6605 1051.8184 1058.3610 1068.8915 1082.0318 1091.7936 1103.0220 1112.3219 1125.3049 1138.2075 1139.9788 1145.3321 1155.7222 1161.6499 1172.8064 1175.3679 1191.9912 1193.1092 1194.0376 1208.6670 1212.5988 1216.0695 1221.5400 1228.1396 1255.0951 1266.8659 1272.9820 1275.7365 1287.7937 1296.1820 1298.1900 1306.1823 1317.7490 1324.8344 1330.6567 1334.9036 1348.1745 1351.9740 1355.3294 1364.6557 1366.3142 1376.2309 1379.2479 1383.0886 1387.2325 1417.0623 1432.4778 1441.9409 1450.6439 1452.3940 1454.2681 1456.1861 1462.4282 1464.4543 1466.1075 1473.5918 1475.3775 1483.5666 1484.6694 1492.7736 1498.4891 1579.0490 1590.7293 1603.1698 1612.9392 2850.5922 2857.8713 2864.6212 2868.8748 2879.2268 2899.4789 2949.6459 2950.0152 2963.5935 2982.2140 2991.4046 3007.0818 3018.2156 3024.7991 3028.7663 3030.6126 3036.1845 3040.7997 3047.6183 3048.9237 3051.0955 3069.5137 3109.1196 3116.2310 3127.9477 3128.9163 3146.0489 3155.2627 3162.4291 3172.5031 3575.6964
redmass: 4.0543 5.6568 4.6198 2.7687 4.2381 2.8625 4.9537 3.8894 3.3457 3.7515 4.0310 3.6036 3.4537 2.9558 2.5498 1.9061 1.0923 3.6086 3.9824 2.7972 2.9847 4.4977 2.6133 2.8730 3.4360 2.6283 2.7102 2.1949 2.8661 2.7235 3.7968 3.2107 2.9003 2.7127 3.2463 3.3243 4.0420 4.2722 3.5305 3.0573 2.3157 4.8261 5.1508 3.1070 2.7143 2.5470 1.6428 1.4512 3.0070 3.0211 3.5773 1.1789 1.8713 1.5239 1.3665 1.9761 1.7866 2.7894 2.2162 2.2268 1.4944 1.3899 2.0306 1.5985 2.8025 2.6471 1.3299 2.5762 2.5030 2.2935 2.6017 2.3642 2.2059 1.7316 2.0912 2.1383 1.9183 2.6037 2.1342 1.9932 2.0456 2.3576 2.3250 2.8444 1.6665 1.2129 1.0660 1.1975 1.1381 1.4723 1.3338 2.0288 1.4185 1.2640 1.9773 1.4080 1.7183 1.4337 1.3812 1.3426 1.2375 1.3929 1.3712 1.2702 1.7713 1.6239 1.3178 1.3953 1.4082 1.3809 1.9407 1.4744 1.4257 3.0694 1.4285 3.7394 1.5907 1.4805 2.2096 2.2999 1.0824 1.0801 1.1513 1.0923 1.0975 1.1323 1.1234 1.0817 1.1039 2.0893 1.0841 2.5101 1.1664 6.6134 7.2229 6.2216 6.1640 1.0709 1.0700 1.0700 1.0703 1.0691 1.0693 1.0684 1.0569 1.0618 1.0624 1.0640 1.1020 1.0978 1.0887 1.0901 1.0889 1.0881 1.0884 1.1003 1.0943 1.0973 1.0929 1.0876 1.0869 1.0880 1.0877 1.0934 1.0956 1.1005 1.0953 1.0666
irintensity: 0.3635 0.0120 0.2181 1.9803 0.4939 6.3914 1.2497 2.4083 0.3315 1.1367 0.5730 0.1269 2.3552 9.8503 3.3035 8.0479 142.5822 2.7594 2.7816 3.3470 2.2387 0.1311 8.5330 7.1657 0.3486 12.5366 4.2463 2.7749 5.6089 6.1318 3.4851 8.9806 3.2273 0.7995 0.8157 0.3065 1.0251 0.4377 7.6781 10.6163 0.1203 5.7345 3.7842 1.6106 19.5315 27.8264 28.9272 110.1667 7.1454 2.3714 17.2763 0.6126 5.8907 0.3797 1.5646 0.4362 2.1501 2.9795 12.3717 4.3147 4.8699 4.8226 1.7553 2.4259 43.6459 105.7213 2.0230 29.9825 13.7740 10.6842 8.0797 2.8846 6.5908 1.1309 2.1951 5.4590 13.4288 3.6274 1.4083 23.9481 18.7906 42.0674 32.9776 54.6456 7.1961 7.4549 0.1002 1.1639 13.7369 19.8176 14.6063 12.5450 16.4746 47.8073 53.0746 3.7501 3.6208 16.1098 5.4859 6.3549 4.8025 3.4056 46.0463 1.8801 104.8922 35.5515 5.5493 9.3620 3.5968 1.2516 4.2351 17.5011 5.5931 4.1516 3.5964 0.6731 0.3389 0.4148 24.4747 45.6007 0.1773 0.2761 20.9977 6.4480 11.3899 3.7528 14.6188 11.2212 11.3555 220.6135 6.7122 23.1680 16.7263 23.5654 10.2199 45.1220 17.7862 80.6679 7.4141 17.1358 32.5731 263.3865 106.3530 37.5099 76.8785 29.6433 27.2745 38.1401 42.3583 41.4342 2.4944 15.1876 79.8534 68.4888 12.2436 34.6881 69.1541 44.1693 12.5100 13.9233 8.6037 12.3909 8.9144 27.4519 39.1732 26.7365 17.7542 3.3431
temp: 298.150 k
press: 1.00000 atm
elementType: 8 7 7 7 6 6 6 6 6 6 6 6 6 6 6 6 6 6 6 6 6 6 6 6 6 6 6 1 1 1 1 1 1 1 1 1 1 1 1 1 1 1 1 1 1 1 1 1 1 1 1 1 1 1 1 1 1 1
symmnumber: 1
zpe: 1306354.9 jmol-1
zpe.correction: 0.497564 hartree
zpe.thermalcorrener: 0.522770 hartree
zpe.thermalcorrenthalpy: 0.523714 hartree
zpe.thermalcorrgfe: 0.437483 hartree
zpe.sumelectzpe: -1132.450748 hartree
zpe.sumelectthermal: -1132.425542 hartree
zpe.sumelectthermalent: -1132.424598 hartree
zpe.sumelectthermalfe: -1132.510829 hartree
dipole: -0.8302 -0.3256 -1.6677
dipole: 1.8912
quadrupole: -167.3748 -154.6725 -154.7558
quadrupole: -1.6275 6.8375 -8.8237
quadrupole: -8.4404 4.2619 4.1786 -1.6275 6.8375 -8.8237
hfenergy: -1132.9483121 hartree
pointgroup: C01 [X(C23H31N3O1)]
dipole: 0.3248202 0.2235987 -0.6309521 debye
polarizability: 314.8952327|-51.0599409|267.5067184|21.7081908|22.5380385|227.3252033 unknown
InChI: InChI=1S/C23H31N3O/c27-19-18-25-16-14-24(15-17-25)12-5-13-26-22-8-3-1-6-20(22)10-11-21-7-2-4-9-23(21)26/h1-4,6-9,27H,5,10-19H2
charge 0 multiplicity 1
58 atoms
O  8.038647 -0.337304 -0.139083
N  1.685773 1.45206 -0.107594
N  4.551833 1.010101 -0.020243
N  -1.786742 0.018218 0.556311
C  2.608663 2.484922 0.42147
C  2.366124 0.629924 -1.137624
C  3.870639 1.831901 1.009978
C  3.623948 -0.024614 -0.543702
C  0.381147 2.001793 -0.551005
C  -0.587634 2.246013 0.628138
C  -0.929822 0.930328 1.365482
C  5.844904 0.451467 0.441785
C  -3.126139 0.426327 0.235981
C  -1.340313 -1.349886 0.47081
C  -3.911282 -0.121589 -0.83684
C  -1.348041 -2.046814 -0.770088
C  -3.458982 -1.190158 -1.834048
C  -1.930306 -1.374732 -1.991391
C  6.811902 0.229052 -0.728956
C  -3.716948 1.459111 1.031092
C  -0.824152 -1.994372 1.627386
C  -5.229675 0.368756 -1.028258
C  -0.856821 -3.373212 -0.818832
C  -5.025472 1.92596 0.81231
C  -0.323613 -3.311072 1.559298
C  -5.804814 1.373781 -0.226556
C  -0.339142 -4.010516 0.330836
H  2.095142 3.061058 1.213007
H  2.916121 3.201719 -0.382224
H  1.669452 -0.159863 -1.47571
H  2.664144 1.240442 -2.027436
H  4.566618 2.620873 1.351116
H  3.574704 1.220178 1.900046
H  3.309537 -0.732959 0.264157
H  4.136037 -0.609739 -1.329119
H  0.50732 2.948178 -1.133412
H  -0.08465 1.265078 -1.232474
H  -0.131148 2.94329 1.358833
H  -1.502696 2.736814 0.24847
H  -1.370351 1.142303 2.362094
H  0.029503 0.412656 1.531243
H  5.723165 -0.509049 0.997871
H  6.315696 1.17013 1.137319
H  -3.894092 -2.17114 -1.553486
H  -3.894879 -0.931012 -2.818551
H  -1.462424 -0.383467 -2.152655
H  -1.730877 -1.987774 -2.889373
H  7.00906 1.199129 -1.228975
H  6.375064 -0.470196 -1.473236
H  -3.149121 1.892061 1.857957
H  -0.834123 -1.46758 2.58752
H  -5.81501 -0.056257 -1.854231
H  -0.868254 -3.903749 -1.779158
H  -5.431603 2.71317 1.457714
H  0.063661 -3.792125 2.464579
H  -6.825471 1.722386 -0.415149
H  0.045538 -5.034356 0.270338
H  8.710854 -0.479342 -0.851229
