program: Gaussian 09
title: 000077131
version: EM64L-G09RevD.01
frameworkgroup: C1[X(C6H18Cl2O2Si3)]
method: RPBEPBE
basis: SDD
operation: Freq
keyword: #p
keyword: freq=noraman
keyword: PBEPBE/SDD
title: #p freq=noraman PBEPBE/SDD
converged: NO YES NO NO
title: Mulliken charges:
elementType: Cl Cl Si Si Si O O C C C C C C H H H H H H H H H H H H H H H H H H
charge: -0.356669 -0.361137 1.678270 1.326123 1.301530 -0.997575 -0.962474 -1.055346 -1.051352 -1.025885 -1.031200 -1.020336 -1.015978 0.255053 0.248437 0.242520 0.241247 0.253013 0.251314 0.263244 0.249470 0.260457 0.252453 0.259406 0.257970 0.248546 0.265474 0.254316 0.268104 0.248541 0.252463
chargesum: 0.00000
title: Mulliken charges with hydrogens summed into heavy atoms:
elementType: Cl Cl Si Si Si O O C C C C C C
charge: -0.356669 -0.361137 1.678270 1.326123 1.301530 -0.997575 -0.962474 -0.309336 -0.305777 -0.252714 -0.261371 -0.252000 -0.246870
polarizability: 1.67903279e+02 3.82714468e-01 1.50894935e+02 -1.52337866e-01 2.14097940e+00 1.43510402e+02
1716.lowfreq: -8.9504 -3.6850 0.0014 0.0027 0.0038 7.5495 12.2255 20.0113 31.0390
frequency: 11.7490 19.3093 30.9282 33.1481 45.1460 50.2349 112.3638 121.4875 137.5297 142.4685 150.9218 156.0375 157.4631 159.9900 163.8282 168.5451 170.5983 176.2639 185.4294 192.7060 218.8735 225.4676 229.7082 253.2526 275.7566 328.7670 346.2259 387.9644 403.8590 458.4086 522.8328 644.5958 668.8094 689.2762 722.4996 731.1124 733.6521 815.2823 820.3356 831.1876 842.2169 848.2420 859.4174 887.6161 896.9282 908.9340 920.6171 930.8147 932.2775 1035.1945 1092.8367 1310.0124 1310.7498 1313.4068 1316.1111 1319.1316 1321.6204 1431.9291 1437.6503 1439.0289 1439.5538 1440.2986 1441.2303 1442.6291 1446.8187 1448.4305 1449.7562 1450.2479 1453.5502 2991.8785 2992.6733 2993.7744 2994.1761 2994.3415 2996.3233 3098.5885 3098.9881 3099.2169 3100.8843 3101.1326 3101.2467 3102.1586 3102.5815 3109.1277 3109.5439 3110.2387 3112.7062
redmass: 4.6252 3.8959 3.8734 4.4856 7.0654 9.5332 6.3704 1.0242 1.0252 2.9384 1.1798 2.4870 1.0645 1.2853 1.6782 2.4912 2.9156 1.0881 3.1407 2.8811 3.1771 3.3744 3.8331 5.5927 5.0504 5.0526 12.6045 7.7687 7.8825 5.9480 5.0886 4.2799 4.1915 3.9359 2.2133 2.3242 2.3906 1.2435 1.2660 1.2430 1.8644 1.7876 1.9448 1.3982 1.4014 1.4208 1.4536 1.5645 1.5637 15.9372 15.8524 1.2104 1.2103 1.2048 1.2006 1.1922 1.1921 1.0501 1.0502 1.0513 1.0514 1.0486 1.0507 1.0522 1.0471 1.0469 1.0461 1.0462 1.0460 1.0343 1.0347 1.0343 1.0346 1.0346 1.0346 1.0985 1.0984 1.0988 1.0982 1.0981 1.0987 1.0984 1.0984 1.0986 1.0986 1.0986 1.0988
irintensity: 0.3144 0.1711 1.5832 2.5827 3.6664 1.8494 3.2240 0.0194 0.0523 0.8265 0.2152 1.0522 0.0441 0.2135 0.2253 0.3007 0.8352 0.1150 0.6538 0.7146 5.8169 7.0448 5.8767 28.8243 3.1073 78.3480 27.0013 58.2994 72.5724 50.9694 21.2289 25.7438 14.6724 10.9642 6.7658 9.7603 13.4260 0.1032 2.1039 2.8956 6.0479 13.6042 268.0414 143.8745 169.6389 158.7766 106.7584 34.5088 7.5183 782.2022 673.0298 2.6867 74.1064 92.8282 56.2721 27.3491 19.4160 3.9069 1.3764 3.0949 0.6287 7.9519 2.9301 0.8993 5.2687 12.6242 11.8353 20.6972 8.7642 5.1852 7.3045 4.3716 4.3721 4.1174 5.1836 0.7817 2.5753 1.0609 13.6676 20.2597 11.0626 6.8251 20.1799 6.2719 7.3576 10.1628 8.0002
temp: 298.150 k
press: 1.00000 atm
elementType: 17 17 14 14 14 8 8 6 6 6 6 6 6 1 1 1 1 1 1 1 1 1 1 1 1 1 1 1 1 1 1
symmnumber: 1
zpe: 617696.8 jmol-1
zpe.correction: 0.235268 hartree
zpe.thermalcorrener: 0.258144 hartree
zpe.thermalcorrenthalpy: 0.259089 hartree
zpe.thermalcorrgfe: 0.179518 hartree
zpe.sumelectzpe: -2177.384461 hartree
zpe.sumelectthermal: -2177.361585 hartree
zpe.sumelectthermalent: -2177.360641 hartree
zpe.sumelectthermalfe: -2177.440211 hartree
dipole: 4.4501 1.1565 0.5594
dipole: 4.6318
quadrupole: -123.2823 -114.1684 -112.9588
quadrupole: 6.2376 5.3925 -2.7809
quadrupole: -6.4791 2.6347 3.8444 6.2376 5.3925 -2.7809
hfenergy: -2177.6197296 hartree
pointgroup: C01 [X(C6H18Cl2O2Si3)]
dipole: -1.7929107 -0.2960821 0.1364578 debye
polarizability: 167.7945007|-1.3190738|151.3970849|0.456094|-1.2415342|143.1170301 unknown
InChI: InChI=1S/C6H18Cl2O2Si3/c1-11(2,7)9-13(5,6)10-12(3,4)8/h1-6H3
charge 0 multiplicity 1
31 atoms
Cl 4.286094 -0.670713 0.677677
Cl -1.298047 2.211584 -0.14907
Si -0.083609 -1.815912 -0.059864
Si 2.381027 0.451414 0.361799
Si -2.491892 0.409686 0.47773
O  1.180484 -0.708321 0.144526
O  -1.547134 -0.959237 0.206296
C  -0.084019 -2.438996 -1.844605
C  0.039266 -3.167356 1.25526
C  2.611326 1.465311 -1.213427
C  2.076727 1.432815 1.946469
C  -2.820169 0.646505 2.323486
C  -4.010073 0.381674 -0.643039
H  -0.148138 -1.588189 -2.545376
H  0.842857 -2.997679 -2.065779
H  -0.94461 -3.105787 -2.030942
H  -0.789726 -3.89108 1.160944
H  0.993401 -3.715806 1.16211
H  -0.002724 -2.724111 2.265524
H  1.678835 2.014519 -1.437528
H  3.434522 2.192004 -1.100126
H  2.848531 0.8066 -2.066156
H  2.897382 2.147962 2.130332
H  1.129466 1.995418 1.857175
H  2.011928 0.755328 2.815062
H  -3.381136 -0.21622 2.726766
H  -1.868491 0.729535 2.875971
H  -3.405493 1.564151 2.507299
H  -3.704268 0.316782 -1.700916
H  -4.641327 -0.4951 -0.410069
H  -4.614787 1.29592 -0.513527
