program: Gaussian 09
title: 000077062
version: EM64L-G09RevD.01
frameworkgroup: C1[X(C10H24N2)]
method: RPBEPBE
basis: SDD
operation: Freq
keyword: #pfreq=noraman
keyword: PBEPBE/SDD
title: #p freq=noraman PBEPBE/SDD
converged: YES YES NO NO
title: Mulliken charges:
elementType: N N C C C C C C C C C C H H H H H H H H H H H H H H H H H H H H H H H H
charge: -0.109875 -0.570833 -0.358177 -0.361334 -0.334927 -0.358157 -0.353802 -0.339916 -0.340731 -0.402945 -0.695274 -0.695091 0.198000 0.180667 0.179841 0.200772 0.214229 0.191204 0.182270 0.207889 0.206084 0.185507 0.191055 0.190989 0.191264 0.191457 0.203500 0.203495 0.214553 0.208680 0.212097 0.214363 0.209225 0.211687 0.274156 0.258081
chargesum: 0.00000
title: Mulliken charges with hydrogens summed into heavy atoms:
elementType: N N C C C C C C C C C C
charge: -0.109875 -0.038597 0.020490 0.019279 0.070506 0.032002 0.037788 0.042128 0.041990 0.004050 -0.059945 -0.059816
polarizability: 1.40441094e+02 -4.27620869e-01 1.31891536e+02 -5.97231726e-01 -2.07602430e-01 1.03755769e+02
1716.lowfreq: -10.5944 -0.0006 0.0005 0.0006 2.2473 9.8862 36.1647 39.9158 43.7585
frequency: 35.3532 39.6786 43.7088 49.4138 60.8009 77.6823 103.2489 116.2203 149.9746 170.2270 198.0293 219.4339 224.2063 233.6076 269.5441 291.3253 298.9289 346.6218 409.6983 439.2022 497.8623 520.7997 600.2841 729.7090 731.6121 786.8850 791.2393 792.1223 835.1203 897.1916 897.9739 923.4859 925.7236 957.5207 1004.3327 1023.7938 1050.7096 1068.8683 1070.4068 1080.2086 1087.7090 1105.0740 1111.8000 1113.9896 1143.3365 1190.1932 1209.9098 1233.8355 1237.5510 1246.4600 1265.7412 1269.8752 1279.8068 1282.5665 1286.3173 1294.9050 1300.2052 1342.6288 1343.5546 1347.8258 1369.6907 1374.7777 1387.1307 1389.3776 1390.5896 1463.4503 1464.5039 1469.3364 1470.7050 1473.3387 1476.1104 1476.5088 1478.3827 1480.8068 1486.8978 1488.9643 1490.1072 1641.0250 2837.5764 2847.5766 2897.9789 2915.3611 2961.4023 2961.8222 2971.5071 2971.6723 2973.8530 2977.8699 3002.8702 3003.3318 3007.8858 3015.2208 3017.3058 3033.0634 3043.5198 3046.0520 3068.3517 3068.6422 3070.2650 3070.4314 3459.8435 3586.5344
redmass: 1.8839 2.3354 3.1062 3.3121 1.5737 1.9156 2.5608 2.2386 2.7100 2.5185 1.4017 1.1595 1.2688 1.4274 3.0530 2.5742 2.6294 2.8867 2.8712 2.9626 3.0781 3.0475 1.3055 1.0760 1.0751 1.1823 1.1682 1.1774 3.8032 1.7336 1.7407 1.2802 1.2277 1.6911 3.1023 3.1364 2.4009 2.5639 2.3117 2.2535 2.2124 2.3428 2.2509 2.2613 1.6257 2.0687 1.6417 1.4796 1.5938 1.2511 1.3125 1.3025 1.0728 1.0923 1.1276 1.1836 1.2720 1.4947 1.5282 1.3552 1.3929 1.4108 1.3708 1.2174 1.2758 1.0713 1.0722 1.0692 1.0721 1.0856 1.0427 1.0434 1.0705 1.0660 1.0826 1.0883 1.0884 1.0937 1.0713 1.0709 1.0684 1.0691 1.0587 1.0585 1.0378 1.0395 1.0578 1.0600 1.0971 1.0974 1.0876 1.0878 1.0895 1.0954 1.1014 1.1013 1.1005 1.1004 1.0996 1.0995 1.0450 1.0975
irintensity: 0.0024 0.0271 0.1240 0.3543 0.3556 3.8647 0.1039 0.0423 1.4960 0.6266 26.4827 6.5791 12.1184 6.4289 3.4330 1.4261 7.4699 4.1269 1.7157 4.5736 4.6179 10.2467 227.4419 8.6854 8.6254 2.2003 1.8429 0.9107 8.5297 14.4530 7.1044 4.7092 3.1222 4.3478 3.9245 2.5763 9.6558 32.0224 2.9774 28.6166 26.4822 8.7437 3.7458 7.8013 6.6256 13.2599 4.9740 7.0160 8.8705 8.4212 3.5252 1.6705 0.5506 0.0204 0.9141 2.5550 16.9029 0.6985 0.7986 1.5830 12.9710 4.6289 8.6673 6.2868 5.8396 0.6129 0.5350 1.0967 0.4446 2.1663 12.3401 11.2373 5.3007 4.0833 17.6460 14.2439 4.0069 40.6450 42.5236 133.6726 18.3549 158.2325 19.3149 31.4173 38.9273 22.2320 58.4295 50.8346 10.1265 6.8164 1.4443 7.0286 10.1384 72.9812 59.3185 55.0839 65.6246 122.0702 44.3370 71.4093 1.2066 0.3112
temp: 298.150 k
press: 1.00000 atm
elementType: 7 7 6 6 6 6 6 6 6 6 6 6 1 1 1 1 1 1 1 1 1 1 1 1 1 1 1 1 1 1 1 1 1 1 1 1
symmnumber: 1
zpe: 865723.6 jmol-1
zpe.correction: 0.329737 hartree
zpe.thermalcorrener: 0.346589 hartree
zpe.thermalcorrenthalpy: 0.347533 hartree
zpe.thermalcorrgfe: 0.283287 hartree
zpe.sumelectzpe: -503.900313 hartree
zpe.sumelectthermal: -503.883460 hartree
zpe.sumelectthermalent: -503.882516 hartree
zpe.sumelectthermalfe: -503.946762 hartree
dipole: -0.3634 0.1105 -0.4203
dipole: 0.5665
quadrupole: -75.9096 -75.8219 -80.2525
quadrupole: -1.7067 -0.0545 -6.1520
quadrupole: 1.4184 1.5061 -2.9245 -1.7067 -0.0545 -6.1520
hfenergy: -504.2300492 hartree
pointgroup: C01 [X(C10H24N2)]
dipole: -0.1440345 -0.0424981 0.1646877 debye
polarizability: 140.4332664|0.423939|131.8878234|0.8204328|-0.3483229|103.7673095 unknown
InChI: InChI=1S/C10H24N2/c1-3-5-8-12(10-7-11)9-6-4-2/h3-11H2,1-2H3
charge 0 multiplicity 1
36 atoms
N  0.000113 -0.453433 -0.23739
N  -0.585896 -4.183633 0.229004
C  -0.895525 0.623397 -0.731848
C  1.416512 -0.26513 -0.649173
C  -0.505691 -1.82029 -0.52094
C  -2.124762 0.858277 0.172091
C  2.167627 0.769645 0.215583
C  -3.05762 1.963615 -0.373025
C  3.6190 1.004417 -0.262711
C  -0.103994 -2.830551 0.576846
C  -4.286748 2.208477 0.528968
C  4.377082 2.029569 0.608114
H  -0.311746 1.562799 -0.772356
H  -1.239106 0.423202 -1.780218
H  1.493394 0.027278 -1.728635
H  1.93376 -1.239428 -0.557813
H  -0.154913 -2.212923 -1.504881
H  -1.611403 -1.781429 -0.571989
H  -2.702027 -0.082702 0.28025
H  -1.768278 1.124273 1.186265
H  2.163625 0.419163 1.266123
H  1.622747 1.735456 0.207694
H  -3.395713 1.689117 -1.393575
H  -2.48365 2.907124 -0.480062
H  3.606136 1.35086 -1.31675
H  4.167323 0.039817 -0.260322
H  0.999577 -2.871232 0.646917
H  -0.473622 -2.439142 1.552986
H  -4.936199 3.006031 0.123235
H  -4.897653 1.290676 0.623714
H  -3.976614 2.509456 1.547393
H  5.410362 2.18454 0.246373
H  3.865283 3.010588 0.60046
H  4.433647 1.690847 1.659801
H  -0.145688 -4.942504 0.75649
H  -1.607043 -4.271428 0.216281
