program: Gaussian 09
title: 000077049
version: EM64L-G09RevD.01
frameworkgroup: C1[X(C4H5NO)]
method: RPBEPBE
basis: SDD
operation: Freq
keyword: #pfreq=noraman
keyword: PBEPBE/SDD
title: #p freq=noraman PBEPBE/SDD
converged: NO YES NO NO
title: Mulliken charges:
elementType: O N C C C C H H H H H
charge: -0.190836 -0.014013 -0.428356 -0.418163 -0.043775 -0.148344 0.255788 0.255777 0.270800 0.271117 0.190005
chargesum: 0.00000
title: Mulliken charges with hydrogens summed into heavy atoms:
elementType: O N C C C C
charge: -0.190836 -0.014013 0.083210 0.123754 0.146230 -0.148344
polarizability: 6.64381879e+01 -4.15188207e+00 4.34930119e+01 3.42060771e-02 -1.17063447e-03 3.11543547e+01
1716.lowfreq: -0.0005 -0.0004 0.0004 3.3136 13.5817 32.8474 56.0652 143.3648 176.2987
frequency: 55.3323 143.3647 176.2839 231.0510 368.2167 506.8987 656.0310 665.2852 842.5603 894.9853 960.4668 1045.5322 1068.4643 1167.9209 1267.4859 1269.4899 1347.9605 1369.1165 1429.4144 1446.0051 1643.5263 2200.1700 2887.5712 2983.6825 3016.6852 3028.1106 3072.7905
redmass: 4.1123 6.2163 1.7737 8.6082 3.5527 7.2923 6.2514 1.1698 1.3332 3.1438 4.0759 1.8995 2.7827 1.2168 1.4330 1.0990 1.6062 1.2217 1.0849 1.0843 7.7021 12.4220 1.0858 1.0624 1.0595 1.0983 1.1008
irintensity: 15.2206 16.6485 2.1464 3.0655 0.5093 4.1018 11.9775 13.8197 0.0718 11.1905 0.3177 0.0664 2.9187 1.2333 31.3487 0.3828 11.5817 6.5974 29.5570 29.3508 119.6653 13.7630 119.4934 18.9486 4.2063 4.4676 4.9187
temp: 298.150 k
press: 1.00000 atm
elementType: 8 7 6 6 6 6 1 1 1 1 1
symmnumber: 1
zpe: 213799.0 jmol-1
zpe.correction: 0.081432 hartree
zpe.thermalcorrener: 0.087977 hartree
zpe.thermalcorrenthalpy: 0.088921 hartree
zpe.thermalcorrgfe: 0.050626 hartree
zpe.sumelectzpe: -284.913552 hartree
zpe.sumelectthermal: -284.907006 hartree
zpe.sumelectthermalent: -284.906062 hartree
zpe.sumelectthermalfe: -284.944358 hartree
dipole: 2.4521 1.8444 0.0165
dipole: 3.0684
quadrupole: -54.6836 -33.4877 -33.3439
quadrupole: 6.8541 -0.0125 -0.0056
quadrupole: -14.1785 7.0173 7.1612 6.8541 -0.0125 -0.0056
hfenergy: -284.9949833 hartree
pointgroup: C01 [X(C4H5N1O1)]
dipole: -0.9590113 0.7332209 -0.0025655 debye
dipolederiv: -0.6563427 -0.113208 0.0000166 -0.26074 -0.6843659 -0.0011648 -0.0009918 -0.0020069 -0.2907693 -0.3447671 0.02781 0.0000323 -0.0359177 -0.2261514 0.0000056 -0.0006058 0.0001703 -0.2350329 -0.4414681 -0.1749774 -0.0008643 -0.3144639 -0.0446741 -0.0011645 -0.0017023 -0.0012639 0.1646986 -0.0486708 -0.015651 -0.0007304 -0.0027017 0.1084188 -0.0008064 -0.000096 -0.0006694 0.2121692 1.0775987 0.151969 -0.0002495 0.1895246 0.8673036 0.0030283 -0.0001169 0.0031293 0.0724719 0.2712731 0.0441826 0.0013801 0.1114212 -0.0659605 0.0000828 0.0020449 -0.0000472 -0.0611985 0.0737181 -0.0035405 -0.0131336 0.0574092 0.0479969 -0.082309 -0.0167114 -0.1059787 -0.0010752 0.0732788 -0.0031803 0.0129889 0.0579229 0.0450896 0.0828045 0.0176036 0.1068259 0.001473 0.0676368 -0.0189878 -0.0137666 0.01381 0.0688539 -0.0629569 -0.0113028 -0.0757487 0.0158754 0.0688519 -0.0201012 0.0136515 0.0135748 0.0666187 0.0637489 0.0113012 0.0762769 0.0190905 -0.1411087 0.1256846 0.000675 0.1701607 -0.1831296 -0.0012686 0.0005774 -0.0006876 0.1022972 unknown
polarizability: 66.5017938|3.9713328|43.4289534|0.0679338|0.072517|31.1548073 unknown
InChI: InChI=1S/C4H5NO/c5-3-1-2-4-6/h4H,1-2H2
charge 0 multiplicity 1
11 atoms
O  -2.494095 -0.682861 -0.006608
N  2.947225 0.06127 0.00016
C  -0.52341 0.779902 -0.002059
C  0.342786 -0.503068 -0.011839
C  -2.01214 0.474185 -0.001182
C  1.781619 -0.19584 -0.005043
H  -0.297916 1.408118 0.883854
H  -0.300425 1.42048 -0.879563
H  0.099815 -1.11306 -0.901171
H  0.094296 -1.129697 0.864259
H  -2.676256 1.375472 0.001692
