program: Gaussian 09
title: 000077025
version: EM64L-G09RevD.01
frameworkgroup: C1[X(C10H10N2)]
method: RPBEPBE
basis: SDD
operation: Freq
keyword: #pfreq=noraman
keyword: PBEPBE/SDD
title: #p freq=noraman PBEPBE/SDD
converged: NO YES NO NO
title: Mulliken charges:
elementType: N N C C C C C C C C C C H H H H H H H H H H
charge: -0.135807 -0.081453 0.040432 0.357644 -0.225089 -0.612644 -0.385703 -0.385695 -0.330388 -0.215941 -0.215896 -0.233749 0.255217 0.230530 0.250944 0.250905 0.248047 0.248104 0.252450 0.228870 0.228877 0.230346
chargesum: 0.00000
title: Mulliken charges with hydrogens summed into heavy atoms:
elementType: N N C C C C C C C C C C
charge: -0.135807 -0.081453 0.040432 0.357644 0.030128 0.119734 -0.137656 -0.137591 -0.077938 0.012930 0.012981 -0.003403
polarizability: 1.55968030e+02 -5.78409964e+00 8.49370917e+01 3.26709351e-02 1.32578010e-01 9.45413000e+01
1716.lowfreq: -84.4594 -55.9254 -9.7996 -0.0007 -0.0006 -0.0006 10.7313 12.6691 87.2310
frequency: -84.4563 -55.8325 87.2186 95.1085 199.4170 242.2468 324.4798 378.7298 397.8526 400.6060 542.1099 610.9935 622.5008 657.9355 697.8589 705.6618 716.4570 735.8805 775.7058 839.2423 857.9515 892.2160 930.8861 980.9280 988.7809 998.8049 1005.9505 1026.3564 1050.0898 1071.8140 1075.9782 1116.9487 1118.9936 1172.7538 1186.9470 1224.0631 1268.2119 1310.7630 1313.4876 1369.4876 1383.6436 1428.3934 1435.7911 1446.9070 1467.0200 1479.8917 1488.5988 1522.1954 1584.6018 1618.8014 2998.9338 3085.2739 3115.2475 3124.0431 3130.7095 3141.7886 3151.6070 3165.5671 3221.0285 3249.3421
redmass: 1.0423 3.9337 4.1361 4.3401 3.2506 3.5509 6.0280 5.3216 3.3456 2.8202 3.2987 6.0691 3.2582 5.4710 5.0925 1.7009 3.2911 1.6511 1.9762 1.3680 1.2429 6.2264 1.4273 1.3877 5.8731 1.3750 4.5326 2.0489 1.7484 1.3812 1.6038 2.3927 1.3192 1.0538 1.1143 3.9168 2.4572 1.3631 4.3445 7.1390 2.9525 2.1851 1.8309 1.9740 1.0407 2.7343 1.1337 4.5108 6.0121 6.4487 1.0340 1.1020 1.1010 1.0846 1.0879 1.0927 1.0970 1.1018 1.0908 1.1088
irintensity: 0.1362 1.3657 3.0555 1.2029 0.4894 1.4847 0.8270 6.3943 2.5715 0.0095 8.8242 0.0128 0.0046 3.4112 2.8255 53.8291 26.9000 47.8403 59.1177 8.5886 0.0207 2.8982 5.1731 0.0453 0.2468 1.3626 16.2176 4.8097 2.1662 10.8129 8.9433 15.6866 0.7916 0.0023 1.1204 0.0429 34.5487 0.1668 4.0124 0.1780 21.3361 7.3409 19.1605 24.3239 19.6146 15.2246 25.3752 4.9265 1.3552 0.4693 36.8780 16.3063 18.2674 0.8837 0.5020 18.5294 35.0474 19.6488 3.0832 6.4704
temp: 298.150 k
press: 1.00000 atm
elementType: 7 7 6 6 6 6 6 6 6 6 6 6 1 1 1 1 1 1 1 1 1 1
symmnumber: 1
zpe: 461942.8 jmol-1
zpe.correction: 0.175945 hartree
zpe.thermalcorrener: 0.184523 hartree
zpe.thermalcorrenthalpy: 0.185467 hartree
zpe.thermalcorrgfe: 0.141774 hartree
zpe.sumelectzpe: -495.707024 hartree
zpe.sumelectthermal: -495.698446 hartree
zpe.sumelectthermalent: -495.697502 hartree
zpe.sumelectthermalfe: -495.741194 hartree
dipole: -0.4094 4.4313 -0.0211
dipole: 4.4502
quadrupole: -59.1450 -74.0316 -66.3800
quadrupole: 5.2567 -0.0229 0.0546
quadrupole: 7.3739 -7.5127 0.1389 5.2567 -0.0229 0.0546
hfenergy: -495.8829686 hartree
pointgroup: C01 [X(C10H10N2)]
dipole: -0.1776141 -1.7418186 0.00469 debye
dipolederiv: -0.1987486 -0.2297921 0.000575 -0.1809675 -0.6868559 0.0014827 0.0000645 0.0019797 -0.0845816 -0.4506381 -0.0561254 0.0001417 -0.0405707 -0.4873944 0.0006382 0.000695 0.0006993 -0.2402953 0.55716 -0.1098541 0.0002612 -0.0186692 0.5289868 -0.0016485 0.0000012 -0.0015119 -0.0272984 0.204862 -0.0074186 -0.0000135 0.0441161 -0.0736423 0.0003203 -0.0002974 0.0003646 0.0368264 -0.1253269 0.2832659 -0.000751 0.1346559 0.1301905 -0.0008682 -0.0001382 -0.001044 -0.211242 0.159546 0.1169864 -0.0000658 0.052205 0.4253811 -0.0004108 0.0000425 -0.0006637 0.1857719 -0.133032 0.0200167 -0.0852344 0.0284489 -0.1249555 -0.0291585 0.0019306 -0.0114403 0.0441795 -0.1330512 0.0207385 0.0851094 0.0286868 -0.1244273 0.0308581 -0.0021793 0.0129436 0.0439158 0.1072586 0.0331545 -0.0000342 0.057284 0.0140075 -0.0004984 -0.0004453 -0.0005699 -0.1909483 -0.0491018 0.012336 0.1033498 0.0065703 -0.1485522 0.0040823 0.0728494 0.0079685 0.0726354 -0.0490717 0.0114211 -0.1035427 0.0061655 -0.1486323 -0.0020558 -0.072891 -0.0059414 0.0727121 0.1077858 0.0297812 -0.0001145 0.0213172 -0.1563713 0.0005312 -0.0001398 0.0005383 -0.0438083 0.0199351 0.0511615 -0.0001209 0.1000693 0.0267269 0.0005159 -0.0001303 0.0005141 0.2223125 -0.0807482 0.1300738 -0.0007833 0.0381271 -0.0037631 0.0004788 -0.0005155 0.0006182 0.1263207 0.0526618 -0.0874947 0.0960035 -0.0473544 0.0163299 -0.0121453 0.1043906 0.0638318 -0.0383661 0.0532569 -0.0878257 -0.0953552 -0.0478619 0.0155184 0.0116058 -0.1038753 -0.0646986 -0.0388129 0.0568238 -0.0124378 0.0919109 -0.0149862 0.141513 0.0097454 0.088709 0.0032871 -0.0324037 0.0569595 -0.013273 -0.0917161 -0.0158004 0.1413825 -0.0114008 -0.088466 -0.00485 -0.0321705 -0.0305239 -0.0647456 0.0001671 -0.0957617 0.0444115 0.000365 0.0001552 0.0003676 0.1874255 0.0066548 -0.0085585 -0.0865127 -0.0145703 0.1558767 -0.008246 -0.1046497 -0.0067239 -0.0702802 0.0066139 -0.0077658 0.0866314 -0.0136162 0.1559956 0.0061366 0.1047824 0.0046482 -0.070357 -0.1392756 -0.0236444 0.0000943 -0.0274877 0.1582742 -0.0003279 0.0001075 -0.0003171 0.0884643 unknown
polarizability: 156.0715518|5.1080558|84.833055|-0.0248483|0.1123179|94.5418145 unknown
InChI: InChI=1S/C10H10N2/c1-12-8-7-11-10(12)9-5-3-2-4-6-9/h2-8H,1H3
charge 0 multiplicity 1
22 atoms
N  1.792036 -0.782556 0.001846
N  1.644411 1.483138 -0.003995
C  0.935429 0.32853 -0.000977
C  -0.547231 0.197013 -0.000525
C  3.105024 -0.293928 0.00045
C  1.38652 -2.195891 0.005267
C  -1.265066 0.129944 -1.222626
C  -1.26526 0.141193 1.222035
C  2.99292 1.09868 -0.003022
C  -2.672771 0.005467 -1.222932
C  -2.672963 0.016733 1.223245
C  -3.379898 -0.054289 0.000399
H  3.967501 -0.955384 0.00215
H  2.284695 -2.833169 0.009181
H  0.78317 -2.426817 0.90006
H  0.786971 -2.432431 -0.890629
H  -0.718678 0.194775 -2.170447
H  -0.718984 0.214689 2.169279
H  3.788788 1.839803 -0.00487
H  -3.215781 -0.037157 -2.173698
H  -3.216133 -0.017145 2.174271
H  -4.4719 -0.146798 0.000736
