program: Gaussian 09
title: 000077000
version: EM64L-G09RevD.01
frameworkgroup: C1[X(C8H8N2)]
method: RPBEPBE
basis: SDD
operation: Freq
keyword: #p
keyword: freq=noraman
keyword: PBEPBE/SDD
title: #p freq=noraman PBEPBE/SDD
converged: NO YES NO YES
title: Mulliken charges:
elementType: N N C C C C C C C C H H H H H H H H
charge: -0.693468 -0.022514 0.466330 -0.360805 -0.360794 0.486956 -0.599600 -0.402500 -0.402502 -0.123396 0.229493 0.229494 0.252197 0.252161 0.217822 0.217823 0.306651 0.306651
chargesum: 0.00000
title: Mulliken charges with hydrogens summed into heavy atoms:
elementType: N N C C C C C C C C
charge: -0.080165 -0.022514 0.466330 -0.131313 -0.131300 0.486956 -0.095241 -0.184677 -0.184679 -0.123396
polarizability: 1.37206967e+02 2.02576451e-03 8.84918502e+01 5.25197027e+00 -3.57125232e-05 5.97602792e+01
1716.lowfreq: -10.8248 -0.0004 -0.0001 0.0007 4.0378 9.9875 13.3060 72.8905 165.9384
frequency: 10.0378 72.8822 165.9383 277.8359 325.4490 353.0786 364.5573 375.9024 389.9876 402.3672 409.4552 500.4987 572.8732 638.1328 716.2062 772.2033 815.8026 822.7491 835.6583 905.0883 914.8924 944.2312 952.2376 1000.3331 1020.1174 1130.6346 1186.9751 1191.0876 1209.7109 1293.0522 1319.3290 1321.2918 1390.0814 1438.1237 1446.5482 1521.8047 1585.4293 1634.8097 1647.1105 2190.2072 2994.8880 3049.0673 3114.2940 3115.9244 3135.8738 3142.3530 3567.6485 3707.3604
redmass: 4.2583 7.1214 5.5823 2.6330 4.2966 3.3514 1.3289 1.0474 2.6595 7.6463 2.6715 2.9746 4.1986 6.6257 3.3406 3.8174 1.2611 2.6512 3.1580 1.8321 3.3884 1.5792 1.3627 2.8916 1.4226 1.2419 1.1090 1.1048 2.4444 1.4504 3.1664 1.2661 5.4529 3.3334 1.0831 3.0632 6.7089 2.1937 1.7840 12.4109 1.0590 1.1006 1.0870 1.0870 1.0966 1.0975 1.0450 1.1040
irintensity: 2.4549 3.5089 4.5639 5.5471 8.5987 0.0117 318.9870 0.0488 0.8386 0.5056 0.0003 14.4765 16.4315 0.0754 2.4144 13.3352 0.0004 47.8672 29.5445 0.0317 0.6957 0.3312 0.0422 0.1464 0.2542 16.2072 3.6087 20.0409 1.0910 0.5180 65.4357 0.5217 7.6387 0.0787 22.2464 116.9161 4.0257 2.3582 291.6590 12.8216 14.9272 3.5335 0.0091 30.7006 41.1715 1.7181 73.4270 21.6867
temp: 298.150 k
press: 1.00000 atm
elementType: 7 7 6 6 6 6 6 6 6 6 1 1 1 1 1 1 1 1
symmnumber: 1
zpe: 370197.1 jmol-1
zpe.correction: 0.141001 hartree
zpe.thermalcorrener: 0.150311 hartree
zpe.thermalcorrenthalpy: 0.151256 hartree
zpe.thermalcorrgfe: 0.104940 hartree
zpe.sumelectzpe: -418.434087 hartree
zpe.sumelectthermal: -418.424776 hartree
zpe.sumelectthermalent: -418.423832 hartree
zpe.sumelectthermalfe: -418.470147 hartree
dipole: 5.1706 0.0009 -2.4218
dipole: 5.7097
quadrupole: -57.3887 -50.7388 -64.8443
quadrupole: -0.0057 15.2617 0.0037
quadrupole: 0.2685 6.9185 -7.1870 -0.0057 15.2617 0.0037
hfenergy: -418.5750872 hartree
pointgroup: C01 [X(C8H8N2)]
dipole: -2.0682654 -0.0004676 -0.8765877 debye
dipolederiv: -1.5746001 0.0000029 0.1731775 0.0000257 -0.0894026 -0.000164 0.2148514 -0.0001545 -0.7955898 -0.3399762 0.0001182 -0.0097847 -0.0001382 -0.236161 0.0000513 -0.1934799 0.0001814 -0.2356278 0.0654068 0.0000071 0.005588 -0.0000132 -0.2487398 0.0000283 0.0186658 -0.0000014 -0.1886842 0.1587332 0.1312839 -0.0870367 0.0391306 0.1652895 0.002145 -0.0900217 -0.0527858 -0.1010048 0.1587269 -0.1313147 -0.0869927 -0.0391744 0.1652955 -0.0022517 -0.0900083 0.0526817 -0.1010199 1.6031943 -0.0000458 -0.3612838 -0.0000804 -0.0341274 0.0000647 -0.419195 0.0000556 0.2509645 0.229896 -0.000035 -0.0886834 0.0001044 0.223081 0.000065 -0.0667316 -0.0000046 0.1440029 -0.4137344 -0.0656647 0.028592 0.3917401 0.0588138 -0.0959504 0.0498312 0.0179618 -0.2284558 -0.4137162 0.0656583 0.0285599 -0.3917135 0.0588333 0.0958457 0.0499973 -0.018061 -0.2284862 -0.0393422 -0.0000647 0.1555426 0.0000718 -0.0490244 -0.0000986 0.257353 -0.0001482 0.0757536 0.043001 0.1015611 0.0383487 0.0949175 -0.0529937 -0.0212206 0.0281118 -0.0268457 0.1304734 0.0430024 -0.1015387 0.0383852 -0.0949028 -0.052976 0.0212926 0.0281401 0.0269149 0.1304509 0.0176571 -0.0149875 -0.0095535 -0.0694339 -0.0062758 0.1055868 -0.001147 0.0424534 0.0444609 0.0176952 0.0149807 -0.0095104 0.0694187 -0.0063726 -0.1055957 -0.0011271 -0.0424463 0.0445254 -0.0061409 -0.1057659 0.0422752 -0.0938316 -0.0636695 0.0224346 0.0546357 0.0271066 0.15579 -0.0061436 0.1057778 0.0422348 0.0938517 -0.0636826 -0.0223527 0.0546015 -0.0270247 0.1558102 0.2281677 -0.0125284 0.0500745 -0.0341113 0.1160559 0.0050361 0.0527583 0.0002347 0.3733199 0.2281729 0.0125557 0.050067 0.0341389 0.1160562 -0.0049165 0.0527645 -0.0001178 0.3733168 unknown
polarizability: 136.7102182|0.004481|88.4918505|-8.1122118|-0.0002044|60.2570279 unknown
InChI: InChI=1S/C8H8N2/c9-6-5-7-1-3-8(10)4-2-7/h1-4H,5,10H2
charge 0 multiplicity 1
18 atoms
N  -3.55511 0.000031 0.60134
N  3.670855 0.000819 1.140895
C  0.543409 -0.000173 -0.562389
C  -0.156116 -1.215287 -0.361895
C  -0.156125 1.215012 -0.362346
C  -2.212957 -0.000034 0.222104
C  2.019957 -0.000244 -0.963055
C  -1.510186 -1.224554 0.021856
C  -1.510197 1.224417 0.021392
C  2.938221 -0.000045 0.198118
H  0.364157 -2.170779 -0.503825
H  0.364142 2.170455 -0.504634
H  2.255496 0.887158 -1.580661
H  2.255501 -0.887904 -1.580287
H  -2.030352 -2.179146 0.167902
H  -2.030372 2.179059 0.167082
H  -4.053679 0.871509 0.753795
H  -4.053646 -0.871393 0.754209
