program: Gaussian 09
title: 000077008
version: EM64L-G09RevD.01
frameworkgroup: C1[X(C8H17NO4Si)]
method: RPBEPBE
basis: SDD
operation: Freq
keyword: #p
keyword: freq=noraman
keyword: PBEPBE/SDD
title: #p freq=noraman PBEPBE/SDD
converged: YES YES NO NO
title: Mulliken charges:
elementType: Si O O O O N C C C C C C C C H H H H H H H H H H H H H H H H H
charge: 1.569804 -0.529157 -0.536970 -0.518510 -0.586170 -0.278415 -0.370899 -0.366178 -0.370821 -0.275689 -0.276658 -0.278706 -0.202569 -0.664394 0.223655 0.236798 0.223768 0.234092 0.223287 0.237232 0.225944 0.192264 0.225173 0.196276 0.228850 0.195167 0.199065 0.204019 0.188508 0.225573 0.225663
chargesum: 0.00000
title: Mulliken charges with hydrogens summed into heavy atoms:
elementType: Si O O O O N C C C C C C C C
charge: 1.569804 -0.529157 -0.536970 -0.518510 -0.586170 -0.278415 0.089553 0.091683 0.089697 0.142518 0.144792 0.145311 0.200515 -0.024650
polarizability: 1.39325406e+02 1.47927795e+00 1.14307084e+02 -4.79511430e-02 7.51494056e-02 1.12961440e+02
1716.lowfreq: -14.9760 -10.0243 -0.0008 0.0008 0.0015 11.5696 27.7830 51.1953 76.1767
frequency: 27.1804 51.1453 76.1168 84.4780 147.9417 155.5494 195.3316 214.2085 229.2055 249.5674 284.4752 294.5232 296.3045 332.5320 337.8039 353.1722 420.8261 422.5764 461.7536 518.9000 554.2986 580.1230 582.7481 693.6004 696.8297 719.1614 739.0332 805.6514 864.1054 869.0083 884.1149 922.5064 923.3462 942.2663 1001.7905 1044.1529 1046.8417 1064.1817 1064.9063 1068.1571 1074.5931 1095.8125 1105.5837 1138.6186 1150.7127 1152.1092 1201.7614 1217.2459 1219.2838 1250.1651 1257.1168 1263.8102 1264.7689 1341.4893 1344.9604 1347.5121 1357.5559 1358.5600 1360.0690 1361.9923 1387.1780 1455.1526 1457.7524 1458.3977 1462.4981 1478.6676 1483.3667 1485.7143 1486.3887 1491.7074 2952.1354 2956.7593 2959.2027 2959.9572 2972.6410 2973.7179 2979.7313 2985.4026 3007.0047 3053.1727 3053.8211 3057.8789 3065.6859 3071.2859 3072.9284 3082.2792 3099.5191
redmass: 2.7428 2.1239 3.9549 4.3004 3.3210 3.2580 5.2991 2.8906 3.6478 1.3182 1.9328 3.7603 3.9575 3.6958 4.2510 4.6189 3.1739 3.0554 4.1199 8.3151 2.8844 2.7080 2.7277 10.1165 3.7199 9.1989 3.1702 1.0848 1.9486 1.9449 2.3092 2.1767 2.1764 2.5849 2.6768 2.5282 2.3519 4.0259 4.1203 5.4952 2.5768 4.1126 2.1776 1.4568 1.7214 1.7312 1.0914 1.2517 1.2495 1.1789 1.1351 1.5186 1.5172 1.2793 1.2617 1.2641 1.2837 1.3000 1.3042 1.2524 1.2685 1.0418 1.0869 1.0923 1.0867 1.0470 1.0806 1.0800 1.0804 1.0829 1.0555 1.0667 1.0667 1.0671 1.0652 1.0651 1.0653 1.0364 1.1071 1.0957 1.0953 1.0958 1.0987 1.1000 1.0998 1.0980 1.1013
irintensity: 1.9004 7.1970 6.4039 7.7621 1.1866 3.8659 35.6176 2.9463 6.5700 1.4042 1.5302 4.9889 13.3249 9.3933 14.4034 7.6156 0.0422 0.2530 2.6721 0.2759 51.4940 5.8092 9.2193 148.7674 127.3469 123.3013 31.0543 3.3211 10.5294 12.3083 84.9761 16.6001 16.3511 110.5809 35.5694 19.6541 18.7295 204.5594 151.1709 178.8060 115.5610 5.2123 8.0100 3.2703 3.6382 2.8987 2.8880 1.9912 1.9886 10.4254 0.8469 13.4721 12.5505 3.6284 1.3154 1.4433 4.6534 3.6901 1.9085 4.4244 28.5387 9.1798 4.8346 11.2377 7.5801 4.5164 8.7745 8.9788 4.7568 4.0418 44.7363 54.2202 45.7937 55.5432 34.9900 36.6719 159.9049 29.2997 32.7577 29.0836 38.2755 36.2354 0.4392 47.4342 40.7772 44.7884 42.9425
temp: 298.150 k
press: 1.00000 atm
elementType: 14 8 8 8 8 7 6 6 6 6 6 6 6 6 1 1 1 1 1 1 1 1 1 1 1 1 1 1 1 1 1
symmnumber: 1
zpe: 676093.9 jmol-1
zpe.correction: 0.257511 hartree
zpe.thermalcorrener: 0.272350 hartree
zpe.thermalcorrenthalpy: 0.273295 hartree
zpe.thermalcorrgfe: 0.215474 hartree
zpe.sumelectzpe: -959.021142 hartree
zpe.sumelectthermal: -959.006302 hartree
zpe.sumelectthermalent: -959.005358 hartree
zpe.sumelectthermalfe: -959.063178 hartree
dipole: 7.3967 -2.4785 -0.0329
dipole: 7.8010
quadrupole: -81.4257 -90.2189 -89.0595
quadrupole: 4.3173 -0.0229 -0.1392
quadrupole: 5.4757 -3.3175 -2.1581 4.3173 -0.0229 -0.1392
hfenergy: -959.2786523 hartree
pointgroup: C01 [X(C8H17N1O4Si1)]
dipole: 2.9268597 0.8979393 -0.2164208 debye
polarizability: 139.2603946|-1.7629078|114.2881788|0.8443579|-0.3301702|113.0453568 unknown
InChI: InChI=1S/C8H17NO4Si/c1-2-10-14-11-6-3-9(4-7-12-14)5-8-13-14/h2-8H2,1H3
charge 0 multiplicity 1
31 atoms
Si -0.581982 -0.190521 0.076284
O  -0.421716 1.008345 1.352068
O  -0.416205 0.426025 -1.562147
O  -0.055645 -1.824067 0.393251
O  -2.270552 -0.47948 0.140498
N  1.772595 0.146102 0.011204
C  2.023817 0.97101 1.227186
C  1.97854 0.854228 -1.284507
C  2.302114 -1.24634 0.067914
C  0.764293 1.834663 1.473738
C  0.859418 0.399457 -2.251684
C  1.286877 -2.095377 0.869598
C  -3.277996 0.542725 -0.159536
C  -4.654961 -0.099846 0.014561
H  2.936741 1.593514 1.127728
H  2.16204 0.284263 2.080674
H  2.987553 0.666751 -1.705614
H  1.874673 1.937744 -1.098891
H  3.317741 -1.289428 0.512041
H  2.355401 -1.631189 -0.965803
H  0.777168 2.257094 2.493601
H  0.718081 2.675667 0.749582
H  0.791461 1.0837 -3.115344
H  1.062323 -0.623374 -2.633793
H  1.478356 -3.172269 0.723677
H  1.359441 -1.872759 1.955218
H  -3.152942 1.401873 0.53198
H  -3.140011 0.906824 -1.198437
H  -5.457209 0.631026 -0.202954
H  -4.762105 -0.959774 -0.669086
H  -4.777007 -0.465286 1.048896
