program: Gaussian 09
title: 000076966
version: EM64L-G09RevD.01
frameworkgroup: C1[X(C5H10O4Si)]
method: RPBEPBE
basis: SDD
operation: Freq
keyword: #p
keyword: freq=noraman
keyword: PBEPBE/SDD
title: #p freq=noraman PBEPBE/SDD
converged: YES YES NO NO
title: Mulliken charges:
elementType: Si O O O O C C C C C H H H H H H H H H H
charge: 1.260309 -0.557432 -0.548259 -0.235906 -0.249827 -1.056998 0.302184 0.312789 -0.730119 -0.731776 -0.066559 0.299868 0.257952 0.249863 0.243483 0.247674 0.255205 0.248227 0.242521 0.256802
chargesum: 0.00000
title: Mulliken charges with hydrogens summed into heavy atoms:
elementType: Si O O O O C C C C C
charge: 1.193750 -0.557432 -0.548259 -0.235906 -0.249827 -0.249315 0.302184 0.312789 0.016244 0.015773
polarizability: 9.45077905e+01 -2.54427169e-01 8.77276718e+01 1.14091970e+00 4.41054576e+00 8.24564838e+01
1716.lowfreq: -17.4526 -6.8062 -0.0022 -0.0019 -0.0014 1.2504 24.8480 45.2551 46.1473
frequency: 23.2869 45.1385 46.1209 93.8996 97.1934 106.2590 113.3712 122.7488 143.3369 187.0566 244.8433 256.5425 364.4017 366.6462 557.2039 560.1861 575.9780 583.3428 624.3225 657.1791 696.5086 754.6059 776.4165 893.8349 901.3237 909.7436 925.4209 996.1423 1000.2822 1043.4957 1044.5181 1198.2756 1219.8486 1325.4334 1381.5451 1382.8299 1436.6606 1449.1891 1450.0628 1451.2476 1451.2833 1452.1812 1638.9078 1646.3858 2198.0067 3001.6773 3007.8583 3008.1542 3096.3822 3096.7241 3102.8599 3121.6391 3143.7849 3143.9084
redmass: 9.3734 3.3337 3.9576 1.1070 1.0830 4.2321 3.5524 6.4758 1.0592 3.6892 5.3735 4.5296 3.6870 3.4580 3.2153 2.9383 4.0352 3.9092 6.0414 3.1009 2.1701 1.2059 2.6137 1.4877 4.5956 3.7623 1.6431 1.7815 1.7427 1.6906 1.6924 3.9249 4.3954 1.1964 1.2438 1.2463 1.0472 1.0614 1.0621 1.0501 1.0524 1.0473 9.2719 9.5517 1.0433 1.0349 1.0365 1.0365 1.0969 1.0970 1.0981 1.0988 1.1015 1.1015
irintensity: 1.7009 3.2081 5.5399 0.1227 0.1658 0.9140 5.6835 1.3064 0.0706 2.8308 21.4658 17.0298 14.9497 16.3032 4.8328 3.6472 7.1287 9.9240 6.6609 29.4881 14.2171 82.6262 84.5662 312.7917 50.3832 136.2205 203.9432 84.7559 51.2246 9.4845 13.3732 447.0063 308.4578 54.8451 73.1715 50.7338 12.6886 4.4774 55.0995 21.0640 10.6168 17.8577 78.9568 280.4042 87.5309 4.6584 1.4171 1.5967 6.0313 6.4538 8.5152 1.9192 13.5385 9.8935
temp: 298.150 k
press: 1.00000 atm
elementType: 14 8 8 8 8 6 6 6 6 6 1 1 1 1 1 1 1 1 1 1
symmnumber: 1
zpe: 383500.0 jmol-1
zpe.correction: 0.146067 hartree
zpe.thermalcorrener: 0.159716 hartree
zpe.thermalcorrenthalpy: 0.160660 hartree
zpe.thermalcorrgfe: 0.103569 hartree
zpe.sumelectzpe: -786.102225 hartree
zpe.sumelectthermal: -786.088576 hartree
zpe.sumelectthermalent: -786.087632 hartree
zpe.sumelectthermalfe: -786.144723 hartree
dipole: -0.1811 1.4575 0.0565
dipole: 1.4698
quadrupole: -57.7675 -60.6963 -73.9500
quadrupole: 3.5907 8.6695 -4.8831
quadrupole: 6.3704 3.4416 -9.8121 3.5907 8.6695 -4.8831
hfenergy: -786.248292 hartree
pointgroup: C01 [X(C5H10O4Si1)]
dipole: 0.0936882 -0.5706083 0.0002025 debye
dipolederiv: 2.2558332 -0.1130841 0.1724558 0.0799401 1.8774722 0.2589985 -0.1894201 0.2634565 1.1906503 -1.5807655 0.7110628 0.0201347 0.8343575 -1.2203478 0.0326588 0.1521528 -0.0157002 -0.5695916 -1.3368406 -0.4988015 -0.4427764 -0.6356799 -1.0263276 -0.3422816 -0.5401267 -0.368908 -0.9645982 -0.5615456 0.0714232 0.1382379 0.315433 -0.6526727 0.1695886 -0.1229301 0.3769826 -0.7071212 -0.4979247 -0.1711043 0.0238691 -0.1159578 -0.5083251 0.2112948 -0.2864284 -0.0464764 -0.9140923 -0.3912954 0.0113009 -0.072232 -0.0008406 -0.4707671 0.0289164 -0.0332949 0.060194 -0.3424953 1.3310402 -0.6244001 -0.3065785 -1.0272215 1.1513645 -0.2611879 0.0039044 -0.5200556 0.9264968 1.0528613 0.6978556 0.2689315 0.6745147 0.8826964 -0.0858259 0.7611888 0.2766872 1.4150589 -0.200126 0.0560851 0.186571 0.0458984 -0.0028344 0.0125911 0.260599 -0.0161806 -0.2460178 -0.1347102 -0.1865367 0.0532862 -0.2350493 -0.2386299 0.1067725 0.0957898 0.1442009 -0.0704675 -0.3018574 0.0332984 -0.0144172 0.0269884 -0.2750328 -0.0213492 0.0232544 -0.0436407 -0.2482002 0.1123015 -0.0036317 -0.0520159 0.0126337 0.1603761 -0.0089191 -0.051804 -0.0351963 -0.018806 0.0364551 -0.094981 0.0088687 -0.148315 -0.0256408 -0.0071518 0.0192714 0.0201224 0.1349025 -0.0236866 0.0844142 0.0819405 0.0963247 0.0682248 -0.0380401 0.062056 -0.0294432 0.0711425 0.0003275 0.0949904 0.0075289 0.121251 0.0099154 0.0287957 -0.0201889 0.0507908 0.0844796 0.068418 -0.0519658 0.0385737 -0.0856504 -0.0385895 0.009305 0.0007589 0.0015737 0.1304353 0.0541951 -0.0260037 -0.0859142 0.0080505 0.121626 -0.0469949 -0.0613109 -0.0357208 -0.0020133 0.0558542 -0.0045844 0.0772695 0.0475801 0.0869889 -0.0708677 0.078762 -0.0632349 0.0189785 0.024968 -0.072743 -0.0659346 -0.0622949 0.0774512 -0.0206637 -0.1028714 -0.0514263 -0.0085648 0.0364979 0.0874056 -0.0377988 0.048037 0.0230522 0.0443604 -0.0493622 0.0319751 0.1198236 unknown
polarizability: 94.4587055|-0.0660209|88.0176933|-1.2864168|-4.2603536|82.2155473 unknown
InChI: InChI=1S/C5H10O4Si/c1-4(6)8-10(3)9-5(2)7/h10H,1-3H3
charge 0 multiplicity 1
20 atoms
Si 0.04982 -1.205069 -0.769048
O  -1.311278 -0.687937 0.233196
O  1.269829 0.070653 -0.876529
O  -2.063247 1.037233 -1.126897
O  1.927384 0.107255 1.350873
C  0.690746 -2.755331 0.076281
C  -2.188191 0.356892 -0.085422
C  2.030474 0.561688 0.189109
C  -3.244913 0.523505 0.981403
C  2.942051 1.678006 -0.263735
H  -0.380758 -1.346411 -2.192048
H  1.001478 -2.515551 1.106182
H  -0.096028 -3.529277 0.112631
H  1.559331 -3.17086 -0.464143
H  -3.945676 1.321709 0.697838
H  -3.788739 -0.425616 1.126397
H  -2.762494 0.771085 1.94312
H  3.566465 1.337868 -1.107399
H  3.57694 2.010901 0.569786
H  2.333406 2.522458 -0.632198
