program: Gaussian 09
title: 000076959
version: EM64L-G09RevD.01
frameworkgroup: C1[X(C8H9NO2)]
method: RPBEPBE
basis: SDD
operation: Freq
keyword: #pfreq=noraman
keyword: PBEPBE/SDD
title: #p freq=noraman PBEPBE/SDD
converged: YES YES NO NO
title: Mulliken charges:
elementType: O O N C C C C C C C C H H H H H H H H H
charge: -0.258061 -0.283682 -0.640579 0.299482 0.332286 -0.322003 -0.343874 -0.365027 -0.348217 0.151688 -0.537444 0.193596 0.281966 0.241652 0.255128 0.222987 0.222967 0.249079 0.312389 0.335666
chargesum: 0.00000
title: Mulliken charges with hydrogens summed into heavy atoms:
elementType: O O N C C C C C C C C
charge: -0.258061 -0.283682 0.007477 0.299482 0.332286 -0.128407 -0.061908 -0.123375 -0.093089 0.151688 0.157589
polarizability: 1.58174307e+02 9.44063225e-01 1.02713562e+02 -6.98891409e-04 -1.80042291e-03 4.56871728e+01
1716.lowfreq: -37.8185 -7.5490 0.0006 0.0009 0.0011 6.8226 7.7760 71.6174 133.0255
frequency: -37.8060 71.5814 133.0240 166.2942 218.5494 257.1360 298.5258 329.6957 396.3677 448.3264 455.5141 472.5951 500.9568 564.6259 574.8025 630.5569 670.8158 690.0762 756.9713 792.8457 805.0166 860.5254 924.4320 985.5962 999.6753 999.8470 1041.5427 1111.9346 1115.7821 1126.1858 1154.6118 1186.7980 1239.4296 1302.1825 1351.4712 1378.6168 1426.4810 1436.3328 1467.3004 1471.7086 1502.8103 1557.1910 1593.9913 1621.7522 1631.8246 2961.7329 3050.6789 3120.9567 3129.5047 3154.8414 3166.7433 3174.8673 3535.2108 3689.0832
redmass: 3.8420 3.7912 4.4724 4.2632 1.1553 4.0268 3.8822 5.5989 2.0735 1.5770 5.0283 3.3294 2.1646 4.9001 1.2470 7.0457 4.0873 3.3226 3.7524 5.7824 1.4738 1.5844 1.4221 8.6183 1.9558 1.7132 1.9548 1.2602 1.5599 2.1339 1.3285 1.2999 2.9862 1.2909 3.8036 5.6566 4.1944 1.1692 1.0500 1.0740 2.4985 4.7550 2.7061 6.1891 1.9886 1.0330 1.1040 1.0883 1.0994 1.0882 1.0935 1.0971 1.0447 1.1038
irintensity: 11.0521 1.1648 6.5296 1.5166 0.1617 15.9408 2.5835 2.6128 15.1931 60.9137 0.8898 3.7401 120.1490 31.2313 57.5741 0.6996 0.1817 65.9363 38.1200 7.7139 13.9355 48.8661 0.0467 49.8148 4.1908 3.1163 3.9805 0.2183 15.4294 10.9453 5.5941 116.0450 139.6650 16.0149 323.0079 31.5152 33.7410 2.5959 14.1841 37.2566 54.4864 129.9752 31.6162 156.5664 252.3088 64.2877 47.2591 28.5720 18.3473 0.2057 13.5255 5.1827 37.5160 28.7066
temp: 298.150 k
press: 1.00000 atm
elementType: 8 8 7 6 6 6 6 6 6 6 6 1 1 1 1 1 1 1 1 1
symmnumber: 1
zpe: 410952.7 jmol-1
zpe.correction: 0.156524 hartree
zpe.thermalcorrener: 0.165994 hartree
zpe.thermalcorrenthalpy: 0.166938 hartree
zpe.thermalcorrgfe: 0.121860 hartree
zpe.sumelectzpe: -514.649073 hartree
zpe.sumelectthermal: -514.639602 hartree
zpe.sumelectthermalent: -514.638658 hartree
zpe.sumelectthermalfe: -514.683736 hartree
dipole: -3.0367 -5.0760 -0.0248
dipole: 5.9151
quadrupole: -59.2576 -57.0606 -68.2632
quadrupole: -7.1004 -0.1206 -0.0014
quadrupole: 2.2696 4.4665 -6.7361 -7.1004 -0.1206 -0.0014
hfenergy: -514.8055961 hartree
pointgroup: C01 [X(C8H9N1O2)]
dipole: 1.1859375 2.0022869 -0.0097689 debye
dipolederiv: -1.8711982 -0.2016153 -0.0004038 -0.0583683 -0.3292115 -0.000123 0.0002579 -0.0000159 -0.2985188 -0.9902226 -0.274574 0.0016609 -0.1921556 -0.8633434 0.0037357 0.0001677 0.0033169 -0.38097 -0.7290606 0.450082 -0.0040794 0.5320565 -0.8939857 -0.0001208 -0.0041717 -0.0010645 -0.7114137 -0.7812327 0.0313946 0.0001096 0.00626 -0.1818233 0.0003111 0.0007196 0.000065 -0.0108794 1.6605726 0.0450458 -0.0001474 -0.3116871 0.0924777 0.0000198 -0.0015009 -0.0001283 0.1141119 0.3189762 0.052749 -0.0000591 0.0674905 0.1055242 0.0012007 -0.0019938 0.0014888 -0.1441064 0.238846 -0.0127186 -0.0000792 -0.1464252 0.0997865 0.000736 0.0005777 -0.0001146 -0.105831 -0.4852736 0.004504 0.0000299 0.4493755 -0.0614961 0.0005071 0.0012379 0.0006324 -0.2043582 -0.4591002 -0.0636968 -0.0001623 -0.3118662 0.0511179 0.0006105 -0.0006656 0.0005816 -0.1828188 1.8585424 -0.16249 0.0009939 -0.2822203 1.3940583 -0.0085384 0.0026029 -0.0070414 0.2458011 0.6804026 0.1532405 0.0004208 0.5197286 0.3826471 0.0000949 0.0012864 0.0001023 0.3259276 0.0262405 0.1078372 0.0002792 0.1142028 -0.0920249 -0.0008767 0.0006875 -0.0008262 0.1463159 0.1099733 -0.0858534 -0.0002972 -0.0398212 0.0381348 -0.0004248 -0.0005453 -0.0000013 0.1538296 0.0073767 -0.0908974 -0.0002224 -0.1040699 -0.0210995 -0.0006131 -0.0001115 -0.0006514 0.1689025 0.0532123 0.0714897 0.0001835 0.0702144 -0.0191198 -0.0005222 0.0001581 -0.0005387 0.170314 0.0492718 0.0254106 0.0647136 -0.1453643 -0.0388085 -0.1048842 -0.0082193 -0.1098181 -0.0875489 0.0492847 0.0258109 -0.064612 -0.1453916 -0.0400329 0.1052023 0.0073939 0.1101021 -0.086339 -0.1432162 0.0348282 0.0001365 0.0816392 0.0705641 -0.0001695 0.0002769 -0.0001509 0.1254058 0.2156069 -0.0870766 0.0012345 -0.085191 0.1283787 0.0022004 0.0014371 0.0025377 0.3784582 0.1909979 -0.0234706 0.0003003 -0.0184069 0.1782562 0.0016541 0.0004047 0.0015244 0.3837175 unknown
polarizability: 158.1649415|1.1876749|102.7229276|0.000691|0.0018035|45.6871728 unknown
InChI: InChI=1S/C8H9NO2/c1-11-7-4-2-6(3-5-7)8(9)10/h2-5H,9H2,1H3
charge 0 multiplicity 1
20 atoms
O  3.1061 -0.440331 -0.000712
O  -3.300637 -0.99249 0.008423
N  -3.229261 1.316225 -0.005734
C  -1.104239 0.043671 0.001285
C  1.727507 -0.2045 0.000245
C  -0.275722 1.193091 0.004482
C  -0.484032 -1.236547 -0.00186
C  1.131142 1.082541 0.003992
C  0.911345 -1.365922 -0.002549
C  -2.608153 0.074391 0.001731
C  3.999737 0.721271 0.002476
H  -0.703379 2.2032 0.00886
H  -1.135256 -2.116425 -0.003567
H  1.743435 1.988856 0.006841
H  1.395813 -2.346711 -0.005133
H  3.852228 1.339225 0.909369
H  3.851999 1.344372 -0.900856
H  5.015652 0.300908 0.001154
H  -2.724916 2.198682 -0.015313
H  -4.248062 1.328191 -0.004933
