program: Gaussian 09
title: 000076957
version: EM64L-G09RevD.01
frameworkgroup: C1[X(C10H13NO3)]
method: RPBEPBE
basis: SDD
operation: Freq
keyword: #p
keyword: freq=noraman
keyword: PBEPBE/SDD
title: #p freq=noraman PBEPBE/SDD
converged: YES YES NO NO
title: Mulliken charges:
elementType: O O O N C C C C C C C C C C H H H H H H H H H H H H H
charge: -0.266899 -0.244680 -0.436554 -0.646966 -0.559459 -0.152897 0.482617 -0.392657 -0.370855 0.212593 -0.346916 -0.393244 0.277180 -0.499237 0.232187 0.220120 0.244786 0.235788 0.258411 0.316126 0.292035 0.248121 0.216999 0.234391 0.242797 0.244361 0.351852
chargesum: 0.00000
title: Mulliken charges with hydrogens summed into heavy atoms:
elementType: O O O N C C C C C C C C C C
charge: -0.266899 -0.244680 -0.084701 -0.038805 -0.107153 0.091890 0.482617 -0.156869 -0.112444 0.212593 -0.098795 -0.176245 0.277180 0.222311
polarizability: 1.80521794e+02 5.83663994e+00 1.18988941e+02 -8.74312576e+00 1.09126098e+01 7.64475162e+01
1716.lowfreq: -16.2718 -5.7207 -0.0006 -0.0005 0.0003 2.4756 26.3317 42.1619 56.7195
frequency: 26.1675 42.1289 56.7015 61.6836 103.4637 116.0239 173.4304 179.5004 211.2927 257.7982 288.3225 337.5068 347.0479 353.2042 397.0828 411.8767 414.7555 449.9007 484.6340 502.7775 534.3860 615.3517 636.3368 686.8743 721.2261 765.6632 802.6865 818.3591 826.0045 854.0882 884.0337 933.9562 946.5802 958.9999 992.6690 1005.1692 1096.1033 1111.1268 1113.1751 1143.7383 1148.8056 1159.3822 1170.2598 1178.6989 1197.6706 1217.6061 1245.1790 1273.3220 1301.7352 1321.1087 1359.5882 1391.0955 1423.7760 1425.5630 1453.0000 1462.7218 1464.2965 1503.1120 1590.5365 1596.5568 1625.0843 1645.5469 2895.9002 3006.3691 3008.8182 3076.9076 3109.0037 3111.1449 3122.0097 3151.7510 3152.4233 3168.9989 3504.3041 3581.9402 3651.8249
redmass: 4.1523 4.7063 5.0387 4.2571 1.1360 3.4588 4.5165 4.9688 1.2486 3.3812 3.0717 4.7064 3.5696 1.2093 3.9821 2.8879 3.3438 2.1527 2.9537 1.9238 2.9276 3.4876 6.5412 5.5472 3.7590 4.9233 1.7093 2.3953 2.1434 2.7202 2.5615 1.3895 4.7183 1.3740 2.6757 2.7676 1.5920 1.8148 1.2715 1.3827 1.5400 1.8197 1.6644 1.1288 1.5984 2.2624 2.9137 1.4817 1.2744 1.2643 1.6536 5.9416 1.2107 2.7001 1.0500 1.0985 1.0587 2.7798 1.5284 6.2308 6.4060 2.8625 1.0808 1.0295 1.0590 1.1039 1.1047 1.0892 1.0898 1.1050 1.0947 1.0951 1.0459 1.0659 1.0997
irintensity: 3.2314 1.9630 0.6469 0.2303 0.2840 2.1926 3.4151 3.8943 58.3726 13.6025 2.8404 8.4834 17.5810 136.9875 13.1992 1.7503 9.5523 44.5581 80.7382 92.4985 65.0914 18.0458 0.4033 8.3529 0.5615 18.3178 26.0007 2.0340 18.8782 30.1042 4.9451 0.2781 9.4305 0.1784 2.7933 3.3978 18.7341 163.8052 2.0345 229.0396 42.1246 101.7604 85.7228 0.4164 43.1936 0.8602 30.3849 16.1396 7.9004 6.7829 7.7188 13.1976 16.1939 20.6048 13.9878 5.8302 16.1371 101.7565 212.0559 15.4296 28.9199 81.6938 38.1608 37.7396 20.8418 12.8594 25.3732 22.9146 13.2867 13.6806 9.6512 6.4870 17.2206 37.9538 16.9467
temp: 298.150 k
press: 1.00000 atm
elementType: 8 8 8 7 6 6 6 6 6 6 6 6 6 6 1 1 1 1 1 1 1 1 1 1 1 1 1
symmnumber: 1
zpe: 564385.4 jmol-1
zpe.correction: 0.214963 hartree
zpe.thermalcorrener: 0.229646 hartree
zpe.thermalcorrenthalpy: 0.230590 hartree
zpe.thermalcorrgfe: 0.171899 hartree
zpe.sumelectzpe: -668.221388 hartree
zpe.sumelectthermal: -668.206705 hartree
zpe.sumelectthermalent: -668.205761 hartree
zpe.sumelectthermalfe: -668.264453 hartree
dipole: -0.4307 -0.2315 -0.0680
dipole: 0.4937
quadrupole: -74.0077 -79.3786 -82.8895
quadrupole: 19.4481 1.5349 0.2618
quadrupole: 4.7509 -0.6200 -4.1309 19.4481 1.5349 0.2618
hfenergy: -668.4363513 hartree
pointgroup: C01 [X(C10H13N1O3)]
dipole: -0.1662831 -0.0988072 -0.0177549 debye
polarizability: 179.9879094|7.138963|120.9744391|-10.0820327|6.7016449|74.9959027 unknown
InChI: InChI=1S/C10H13NO3/c1-14-10(13)9(11)6-7-2-4-8(12)5-3-7/h2-5,9,12H,6,11H2,1H3
charge 0 multiplicity 1
27 atoms
O  -3.301584 -1.121105 0.079869
O  -3.817582 1.106355 -0.350911
O  5.013071 -0.056308 -0.450992
N  -1.184152 1.744463 -0.778027
C  -0.636666 -0.205222 0.720217
C  -1.46513 0.33788 -0.501861
C  0.855746 -0.153077 0.446941
C  1.533126 -1.26777 -0.117136
C  1.608276 1.020329 0.708781
C  -2.96876 0.188856 -0.253942
C  2.910728 -1.222443 -0.411523
C  2.989836 1.084144 0.420822
C  3.638944 -0.041446 -0.140866
C  -4.743988 -1.376803 0.317657
H  -0.960491 -1.241422 0.924272
H  -0.896502 0.420507 1.592971
H  -1.234023 -0.33404 -1.362847
H  0.975029 -2.190275 -0.32043
H  1.100816 1.891072 1.137409
H  -2.005184 2.318344 -0.981406
H  -0.3517 1.936164 -1.332604
H  3.435253 -2.082125 -0.839101
H  3.555487 2.000449 0.637117
H  -4.799831 -2.443778 0.5737
H  -5.324911 -1.153351 -0.592864
H  -5.111186 -0.747028 1.145025
H  5.43308 0.808429 -0.217469
