program: Gaussian 09
title: 000002016
version: EM64L-G09RevD.01
frameworkgroup: C1[X(C14H14N3)]
method: RPBEPBE
basis: SDD
operation: Freq
keyword: #p
keyword: freq=noraman
keyword: PBEPBE/SDD
title: #p freq=noraman PBEPBE/SDD
converged: YES YES NO YES
title: Mulliken charges:
elementType: N N N C C C C C C C C C C C C C C H H H H H H H H H H H H H H
charge: -0.240278 -0.667584 -0.667578 0.261739 0.261756 0.414118 0.414213 -0.424164 -0.552082 -0.552039 -0.650935 -0.376570 -0.376571 0.554392 0.554280 -0.443422 -0.443418 0.277597 0.247825 0.247810 0.258204 0.258231 0.266144 0.256068 0.256070 0.252316 0.252315 0.336715 0.344067 0.336716 0.344066
chargesum: 1.00000
title: Mulliken charges with hydrogens summed into heavy atoms:
elementType: N N N C C C C C C C C C C C C C C
charge: -0.240278 0.013198 0.013204 0.261739 0.261756 0.414118 0.414213 -0.146567 -0.304257 -0.304229 0.131644 -0.120503 -0.120502 0.554392 0.554280 -0.191106 -0.191103
polarizability: 4.09182969e+02 3.40975372e-03 1.74035940e+02 -2.63397409e-04 2.98765426e+00 6.96371778e+01
1716.lowfreq: -5.9858 -3.9584 -0.0006 -0.0004 -0.0001 4.6602 56.9564 78.7714 108.5640
frequency: 56.9555 78.7648 108.5567 135.7671 181.6113 183.1058 198.0023 295.5421 309.8334 325.3140 338.4335 405.7850 415.6436 425.8716 456.7238 464.6065 465.9822 477.5003 485.6807 507.5066 531.8049 565.8516 568.0604 594.6614 594.7809 630.1538 651.7006 690.7628 737.2474 758.4329 765.6672 817.8626 825.2586 828.8781 846.3281 847.3522 854.3522 925.7995 935.3370 961.9378 972.1760 982.0604 1032.7237 1054.0142 1059.2436 1110.8824 1114.3796 1153.1534 1176.6887 1207.8318 1237.9871 1277.5512 1301.9301 1302.6486 1321.7286 1350.5749 1373.1848 1411.7090 1428.7572 1439.3801 1451.2475 1473.3090 1495.7305 1507.3922 1508.3323 1529.3048 1537.2197 1560.7469 1607.8795 1634.7058 1657.3167 1660.3331 1667.0547 3007.6658 3111.6253 3135.0948 3141.0742 3143.2797 3143.6227 3164.1411 3164.3692 3173.7781 3174.4162 3539.8967 3541.3406 3675.5469 3675.5698
redmass: 4.6308 2.9347 1.3423 3.2906 4.2570 4.2379 4.0693 3.1560 4.3591 5.6074 4.5621 3.5386 2.6026 2.8630 2.9217 1.0803 1.0838 3.1149 2.6635 4.0906 4.9897 1.2584 1.2595 5.3036 6.2676 4.0504 3.2492 6.5766 2.6502 2.5312 5.2669 1.4493 4.7791 1.5130 2.2451 2.1030 3.1525 4.0065 1.4128 2.3485 1.3557 1.4306 4.1263 1.5136 1.4995 1.9423 1.3350 1.3590 1.2171 1.2404 1.9836 1.5328 2.6129 1.6645 3.6531 1.9576 3.6241 3.4549 1.7561 3.6019 2.1990 1.1244 5.0670 3.7019 1.1498 5.4712 3.4371 5.3378 5.2869 6.0321 1.5529 1.2171 2.8760 1.0394 1.0970 1.1008 1.0924 1.0878 1.0886 1.0987 1.0987 1.0910 1.0912 1.0462 1.0466 1.1039 1.1040
irintensity: 3.0532 0.0112 0.3196 5.3343 0.1956 2.2173 7.8148 0.6442 0.2098 0.4749 0.2016 2.5232 5.1634 16.3850 6.6152 0.0641 7.2342 13.3864 22.3040 5.8506 5.4457 1.7841 546.5962 0.0176 0.9057 0.3366 2.2854 1.1292 0.0011 0.4050 4.1172 36.8746 4.2124 0.2615 0.7860 128.6486 8.0064 1.3627 35.3624 0.0748 0.0815 4.6609 6.9612 0.8112 4.8927 15.0449 0.6135 15.9747 10.0182 184.3102 0.0266 12.4346 67.2540 0.3679 0.4102 89.4411 9.7866 116.4515 0.7911 11.0817 15.3962 1.2873 4.9701 231.0200 26.4985 31.3331 55.7023 15.8658 127.7648 1450.4135 9.5103 396.1686 110.3955 16.5442 10.2584 0.8635 0.4739 0.5285 2.0494 9.7881 5.8731 5.6552 5.3210 562.8395 45.3577 22.8495 56.6164
temp: 298.150 k
press: 1.00000 atm
elementType: 7 7 7 6 6 6 6 6 6 6 6 6 6 6 6 6 6 1 1 1 1 1 1 1 1 1 1 1 1 1 1
symmnumber: 1
zpe: 667755.6 jmol-1
zpe.correction: 0.254335 hartree
zpe.thermalcorrener: 0.268359 hartree
zpe.thermalcorrenthalpy: 0.269303 hartree
zpe.thermalcorrgfe: 0.214452 hartree
zpe.sumelectzpe: -704.796765 hartree
zpe.sumelectthermal: -704.782741 hartree
zpe.sumelectthermalent: -704.781797 hartree
zpe.sumelectthermalfe: -704.836648 hartree
dipole: 0.0002 -2.6688 -0.2878
dipole: 2.6843
quadrupole: -4.3582 -65.5816 -104.9917
quadrupole: -0.0007 0.0015 0.6433
quadrupole: 53.9523 -7.2712 -46.6812 -0.0007 0.0015 0.6433
hfenergy: -705.0510999 hartree
pointgroup: C01 [X(C14H14N3)]
dipole: 0.0000549 -1.0489343 -0.1225663 debye
polarizability: 409.1829677|-0.0000193|173.9746199|0.0189435|3.9145983|69.6984991 unknown
InChI: InChI=1S/C14H14N3/c1-17-13-7-11(15)4-2-9(13)6-10-3-5-12(16)8-14(10)17/h2-8H,15-16H2,1H3
charge 1 multiplicity 1
31 atoms
N  0.000003 -1.090515 0.096782
N  -4.890854 -1.054766 -0.184531
N  4.890735 -1.054818 -0.18382
C  -1.233021 -0.41152 0.029788
C  1.232931 -0.411414 0.029837
C  -1.228216 1.041177 0.064594
C  1.228106 1.041257 0.064611
C  -0.000074 1.731134 0.102096
C  -2.462204 -1.102038 -0.061756
C  2.462064 -1.102012 -0.061414
C  0.000394 -2.565185 0.246235
C  -2.487352 1.734651 0.047845
C  2.487254 1.734709 0.04791
C  -3.691683 -0.38866 -0.086657
C  3.691565 -0.388668 -0.086239
C  -3.689427 1.054308 -0.01778
C  3.68932 1.054318 -0.017552
H  -0.000109 2.826566 0.140063
H  -2.497471 -2.189872 -0.151971
H  2.497218 -2.189884 -0.151347
H  0.883244 -2.877549 0.821454
H  -0.882334 -2.878192 0.821231
H  0.000717 -3.073524 -0.734668
H  -2.477161 2.829306 0.084565
H  2.477086 2.829366 0.084574
H  -4.640394 1.596852 -0.029892
H  4.640302 1.596836 -0.029602
H  -4.935487 -2.071028 -0.231962
H  -5.772065 -0.545435 -0.216268
H  4.935351 -2.071087 -0.23111
H  5.771962 -0.545513 -0.215516
