program: Gaussian 09
title: 000077099
version: EM64L-G09RevD.01
frameworkgroup: C1[X(C10H13ClNO4PS)]
method: RPBEPBE
basis: SDD
operation: Freq
keyword: #p
keyword: freq=noraman
keyword: PBEPBE/SDD
title: #p freq=noraman PBEPBE/SDD
converged: NO YES NO NO
title: Mulliken charges:
elementType: Cl S P O O O O N C C C C C C C C C C H H H H H H H H H H H H H
charge: 0.000008 -0.238017 0.730305 -0.485735 -0.460684 -0.204213 -0.205290 0.020102 -0.599735 -0.634653 0.524692 -0.252487 -0.291546 -0.276569 -0.640929 0.411303 -0.371333 -0.366839 0.288557 0.272928 0.235540 0.238587 0.251314 0.236415 0.234245 0.288241 0.222352 0.239492 0.229338 0.312155 0.292455
chargesum: 0.00000
title: Mulliken charges with hydrogens summed into heavy atoms:
elementType: Cl S P O O O O N C C C C C C C C C C
charge: 0.000008 -0.238017 0.730305 -0.485735 -0.460684 -0.204213 -0.205290 0.020102 -0.038250 0.090788 0.524692 0.218173 -0.291546 0.011672 0.050252 0.411303 -0.059178 -0.074384
polarizability: 2.53397236e+02 6.24134800e+00 1.95377449e+02 -1.24029190e+01 -3.36301734e+00 1.29414180e+02
1716.lowfreq: -11.6950 -9.2134 -3.3612 -0.0026 -0.0025 -0.0024 19.4614 31.3772 36.6719
frequency: 18.4694 30.9981 35.9876 55.2238 59.1857 68.8180 76.2723 110.7912 116.9022 136.7498 153.3607 166.9725 169.2574 176.2465 233.7329 237.6911 250.2130 273.8920 297.8076 323.8683 339.7476 367.4194 397.1289 424.5163 437.6337 449.8765 486.0037 528.0077 534.4285 563.7235 635.4682 649.0630 689.0847 695.7911 707.2983 731.8981 776.3744 788.8596 797.4040 844.4316 858.7596 865.4079 918.7826 979.9181 1000.1408 1011.1970 1028.6424 1054.2402 1063.0061 1091.6250 1097.9500 1134.0717 1140.8459 1209.6508 1224.5796 1245.7886 1250.9558 1271.0584 1285.5213 1350.6599 1356.0430 1387.3992 1391.2200 1402.0277 1404.5920 1423.7041 1457.7747 1459.2492 1463.2940 1475.0142 1478.1291 1486.1275 1576.9277 1588.4163 2988.3308 2998.1699 3001.3768 3032.5001 3075.8778 3089.1763 3090.5789 3098.3699 3107.7806 3116.9644 3174.5836 3188.0879 3193.0111
redmass: 6.4375 6.6682 2.9803 6.3710 13.7338 2.9370 3.7165 3.7667 6.9971 5.0722 3.5262 4.4570 4.6454 3.1833 2.5060 1.7673 1.5405 5.2057 4.4042 5.7993 11.1522 5.6126 5.0957 4.1080 7.3645 3.7160 9.3081 5.6559 6.1537 5.5430 8.4578 7.0146 5.9444 9.1923 5.4012 4.5555 1.2524 8.3581 1.1500 1.5404 4.9488 4.4260 1.4261 1.3418 1.7536 2.8155 2.8234 1.3261 2.2181 2.2124 3.2723 1.3082 1.5591 6.9974 3.7150 1.2103 1.4895 1.1101 1.3244 1.2136 5.9306 11.8125 1.2267 1.2002 4.9494 1.0808 1.1645 2.2583 1.0535 1.0373 1.0598 1.0478 8.6767 7.1327 1.0360 1.0358 1.0631 1.0586 1.1004 1.0986 1.1007 1.1013 1.1033 1.1030 1.0897 1.0928 1.0969
irintensity: 0.1874 0.6561 0.1947 1.0502 0.1736 0.4953 0.5287 0.7181 3.1494 0.5757 6.4358 1.4619 0.6942 1.8315 12.0775 9.3573 1.4500 6.2562 3.1919 21.2915 5.9975 0.8753 2.0806 9.1614 26.6401 12.8870 4.4299 47.6576 18.7861 41.4209 54.6187 74.3876 11.5621 48.0926 87.1421 13.5367 60.9186 46.3254 3.3979 25.4095 120.1400 111.5452 29.9364 0.9968 11.9604 103.7209 57.5695 7.0653 4.7820 12.3641 26.8455 29.0376 5.3210 437.9835 342.8170 5.3030 0.3448 0.3589 3.2716 10.1063 29.7652 41.0779 17.4644 26.6903 84.5312 10.0677 25.9301 103.2350 9.5410 16.9318 19.4518 10.2914 5.6024 111.1196 9.1323 22.4247 29.2856 4.0459 10.8428 25.3391 9.8441 8.2294 22.2873 14.6040 0.5327 8.9678 2.3878
temp: 298.150 k
press: 1.00000 atm
elementType: 17 16 15 8 8 8 8 7 6 6 6 6 6 6 6 6 6 6 1 1 1 1 1 1 1 1 1 1 1 1 1
symmnumber: 1
zpe: 582725.7 jmol-1
zpe.correction: 0.221948 hartree
zpe.thermalcorrener: 0.242307 hartree
zpe.thermalcorrenthalpy: 0.243251 hartree
zpe.thermalcorrgfe: 0.169977 hartree
zpe.sumelectzpe: -1942.418836 hartree
zpe.sumelectthermal: -1942.398478 hartree
zpe.sumelectthermalent: -1942.397534 hartree
zpe.sumelectthermalfe: -1942.470808 hartree
dipole: 5.8839 1.1816 -0.0598
dipole: 6.0017
quadrupole: -148.9547 -134.3876 -118.1424
quadrupole: 0.3505 -1.9748 4.1249
quadrupole: -15.1265 -0.5594 15.6858 0.3505 -1.9748 4.1249
hfenergy: -1942.6407849 hartree
pointgroup: C01 [X(C10H13Cl1N1O4P1S1)]
dipole: -2.264983 0.6268009 -0.2289671 debye
polarizability: 241.1207118|-39.6151427|144.9562763|-4.7520053|-12.1728202|192.1118766 unknown
InChI: InChI=1S/C10H13ClNO4PS/c1-3-15-17(18,4-2)16-10-6-5-8(12(13)14)7-9(10)11/h5-7H,3-4H2,1-2H3
charge 0 multiplicity 1
31 atoms
Cl -0.128225 0.814443 -2.837742
S  -3.060222 -0.630519 2.190369
P  -3.028042 0.325021 0.354731
O  -1.444892 1.028374 -0.148764
O  -3.535642 -0.627647 -1.000614
O  4.165881 -1.729767 1.187657
O  4.368519 -1.416941 -1.064357
N  3.714003 -1.329077 0.045972
C  -4.014101 1.878073 0.0685
C  -3.628624 3.00885 1.038478
C  -0.209403 0.395749 -0.072203
C  -3.436099 -2.118276 -0.968281
C  0.561605 0.260931 -1.261102
C  0.33645 -0.049168 1.160789
C  -2.048686 -2.606736 -1.386698
C  2.358595 -0.733393 0.00874
C  1.848738 -0.293226 -1.233216
C  1.62002 -0.620701 1.206652
H  -3.830701 2.15011 -0.985167
H  -5.071926 1.582539 0.176977
H  -4.261771 3.891113 0.838671
H  -3.780475 2.710156 2.090586
H  -2.574439 3.303921 0.906056
H  -3.708279 -2.47146 0.04522
H  -4.213502 -2.425571 -1.686863
H  -0.259893 0.060397 2.070172
H  -2.065026 -3.706439 -1.503268
H  -1.749125 -2.159594 -2.349807
H  -1.286309 -2.360858 -0.626188
H  2.452845 -0.395319 -2.137839
H  2.057026 -0.970785 2.144838
