program: Gaussian 09
title: 000076905
version: EM64L-G09RevD.01
frameworkgroup: C1[X(C8H10N2O)]
method: RPBEPBE
basis: SDD
operation: Freq
keyword: #p
keyword: freq=noraman
keyword: PBEPBE/SDD
title: #p freq=noraman PBEPBE/SDD
converged: YES YES NO NO
title: Mulliken charges:
elementType: O N N C C C C C C C C H H H H H H H H H H
charge: -0.265748 -0.019802 -0.628879 -0.470090 0.190901 -0.436453 0.309228 -0.676787 -0.296370 -0.373916 0.157698 0.228027 0.212134 0.281984 0.215218 0.220504 0.240274 0.210836 0.240486 0.319872 0.340883
chargesum: 0.00000
title: Mulliken charges with hydrogens summed into heavy atoms:
elementType: O N N C C C C C C C C
charge: -0.265748 -0.019802 0.031876 -0.029930 0.190901 -0.154469 0.309228 -0.000791 -0.085535 -0.133430 0.157698
polarizability: 1.35906124e+02 3.83839491e+00 1.09710156e+02 5.81977826e+00 5.23100155e+00 5.68916997e+01
1716.lowfreq: -9.6676 -0.0006 -0.0001 0.0004 5.9247 9.6198 30.0337 39.3622 121.9814
frequency: 29.5913 39.3133 121.9775 155.9308 173.7243 228.8672 281.7177 334.5951 374.5064 416.1062 464.2265 496.0836 533.7094 563.6578 585.7072 626.2686 716.9826 741.2903 758.4239 786.0824 845.1944 854.6589 946.6445 956.5467 962.2806 993.3758 1043.7028 1058.6487 1067.2377 1112.7795 1124.4985 1227.4126 1242.9383 1296.6264 1308.8654 1317.1811 1345.1704 1380.6944 1408.9733 1448.9462 1464.9083 1474.0020 1487.9046 1546.4290 1587.0177 1589.2707 1637.6978 2983.6409 3002.9331 3058.4731 3082.9814 3094.8300 3122.9593 3147.7645 3161.4841 3528.0758 3680.5661
redmass: 2.6723 4.5862 3.4490 4.9978 2.8375 1.2692 3.2539 2.8033 4.7186 3.2848 2.6622 1.3638 2.7407 2.7195 3.1680 1.8437 5.1224 4.3233 2.7633 1.2398 1.5536 3.7337 1.4398 2.7480 1.7621 2.9132 1.7828 1.8372 1.7397 2.0417 1.4551 1.6236 1.7519 1.7156 2.4582 1.7589 3.1992 1.2333 3.4690 2.1304 1.0985 1.0441 1.0814 6.8380 2.0321 5.8797 2.2300 1.0346 1.0596 1.1017 1.1006 1.1016 1.0874 1.0970 1.0927 1.0449 1.1040
irintensity: 0.2096 13.5710 0.3742 4.5825 5.3868 2.8326 0.3280 1.7731 0.5651 7.1335 32.9291 86.4519 45.8908 28.5530 31.3938 79.4535 7.2737 39.5496 10.0698 3.1566 23.6015 10.5022 8.5381 2.3183 2.9964 0.5456 3.0669 9.4940 10.7273 2.1189 2.4435 3.0774 4.9633 2.6817 2.3642 1.0927 155.3742 13.1320 112.8183 3.5180 6.6759 14.4986 14.7259 80.2125 110.5461 29.3110 220.4129 37.7717 23.9902 3.8326 49.5531 34.4318 9.6708 32.1292 1.4202 39.0142 33.0482
temp: 298.150 k
press: 1.00000 atm
elementType: 8 7 7 6 6 6 6 6 6 6 6 1 1 1 1 1 1 1 1 1 1
symmnumber: 1
zpe: 442750.3 jmol-1
zpe.correction: 0.168635 hartree
zpe.thermalcorrener: 0.179209 hartree
zpe.thermalcorrenthalpy: 0.180153 hartree
zpe.thermalcorrgfe: 0.131206 hartree
zpe.sumelectzpe: -494.784468 hartree
zpe.sumelectthermal: -494.773894 hartree
zpe.sumelectthermalent: -494.772950 hartree
zpe.sumelectthermalfe: -494.821897 hartree
dipole: 1.7677 2.4239 1.5806
dipole: 3.3909
quadrupole: -55.7499 -66.5364 -66.8883
quadrupole: 14.4804 5.5279 0.5008
quadrupole: 7.3083 -3.4782 -3.8301 14.4804 5.5279 0.5008
hfenergy: -494.9531028 hartree
pointgroup: C01 [X(C8H10N2O1)]
dipole: -0.6877665 0.9021099 -0.7021072 debye
dipolederiv: -0.7156997 -0.1805241 0.0228795 -0.0452741 -0.8570662 0.2498267 -0.0663316 0.1878484 -0.4722836 -0.4031177 0.0310519 -0.0117237 0.1356738 -0.4074636 -0.0015994 -0.0368297 0.0202011 -0.2366512 -1.003709 0.3671045 -0.2248343 0.2810863 -0.5416246 -0.0432846 -0.2027022 -0.0473498 -0.6907539 -0.1322779 0.158848 0.0212578 0.0691534 0.0995482 -0.0320943 0.1485476 -0.0831576 0.0484437 0.7057766 -0.4033721 0.0519313 -0.2331703 0.2003487 0.0056302 0.0571005 -0.0434999 -0.0287582 -0.4447891 0.2351997 -0.0283587 -0.05951 -0.0440781 -0.0101919 0.0045297 0.0085078 -0.0720091 -0.167006 -0.1058676 -0.0001431 -0.2157719 0.1096292 0.0057957 0.0511028 0.0018782 0.0355789 0.0305308 0.0176609 0.0448773 0.0539715 0.0411714 0.0065119 -0.0796159 0.0693613 0.0207757 -0.1161904 -0.208609 0.0283145 0.0216229 -0.2125497 0.0070511 -0.0644826 0.0063292 -0.1324854 0.0864792 0.1737524 -0.0118197 -0.0088325 0.372407 -0.0582497 0.006813 -0.0657051 -0.0538049 1.5482151 -0.0374952 0.2531069 -0.0448194 1.0358428 -0.422759 0.3024053 -0.3551398 0.4632042 -0.0173048 -0.0157929 -0.0828843 -0.0404347 0.0263502 -0.0922213 -0.0791545 -0.0448599 -0.0224449 0.0262309 -0.0726172 0.0669562 -0.0036643 -0.0880935 0.1061775 0.0294463 0.0762093 0.018816 0.1541463 -0.0126885 -0.003169 0.0154105 0.0025498 0.0204991 -0.0223584 0.0276853 0.1388946 0.0126486 -0.1014287 -0.1021917 -0.0623898 0.0263099 -0.0960292 -0.0476576 -0.076946 -0.0394567 -0.1646358 0.1508409 -0.0003598 0.1562811 0.0228091 0.0038744 0.0091251 -0.0002692 0.0639575 0.1067191 -0.0273133 0.0268606 -0.0767363 -0.065009 0.1019942 0.0197965 0.058577 0.0332277 -0.065573 0.122443 -0.0296633 0.098903 0.0374444 0.0198856 -0.016106 0.0322047 0.1472288 0.0706681 -0.0180688 0.0017664 -0.0006985 -0.1282997 0.0377462 -0.0007425 0.0385997 0.1234684 0.2768572 -0.0408058 -0.0016041 -0.0251052 0.1646459 0.1061672 0.0096961 0.1088945 0.3176515 0.2120314 -0.0323182 -0.0211989 -0.0156957 0.2051282 0.0852695 -0.0225819 0.0806307 0.3374009 unknown
polarizability: 135.9446714|-4.6637312|108.096631|2.8446866|-11.21424|58.4666771 unknown
InChI: InChI=1S/C8H10N2O/c1-2-7-5-6(8(9)11)3-4-10-7/h3-5H,2,9H2,1H3
charge 0 multiplicity 1
21 atoms
O  -2.498453 -1.702447 0.659726
N  1.616505 1.255124 0.067161
N  -3.420883 0.161442 -0.362798
C  2.696132 -0.910946 0.481864
C  1.435737 -0.088661 0.296328
C  0.145198 -0.670999 0.328774
C  -0.999565 0.132396 0.113844
C  3.436224 -1.13864 -0.862741
C  -0.810217 1.518994 -0.111235
C  0.509146 2.025299 -0.12407
C  -2.351702 -0.543587 0.165387
H  3.368206 -0.369136 1.172361
H  2.446106 -1.883103 0.944533
H  0.00815 -1.73863 0.525801
H  2.809221 -1.709653 -1.571638
H  4.372854 -1.701778 -0.700765
H  3.687238 -0.168513 -1.326072
H  -1.647552 2.213788 -0.239545
H  0.693544 3.093845 -0.285676
H  -3.314181 1.052445 -0.842287
H  -4.341009 -0.276241 -0.330051
