program: Gaussian 09
title: 000076882
version: EM64L-G09RevD.01
frameworkgroup: C1[X(C9H6S3)]
method: RPBEPBE
basis: SDD
operation: Freq
keyword: #p
keyword: freq=noraman
keyword: PBEPBE/SDD
title: #p freq=noraman PBEPBE/SDD
converged: YES YES NO NO
title: Mulliken charges:
elementType: S S S C C C C C C C C C H H H H H H
charge: 0.188545 0.127945 0.132011 0.314178 0.751657 -0.363896 -0.364945 -0.905314 -0.704931 -0.211173 -0.211460 -0.232989 0.245718 0.245522 0.294698 0.231011 0.230979 0.232443
chargesum: 0.00000
title: Mulliken charges with hydrogens summed into heavy atoms:
elementType: S S S C C C C C C C C C
charge: 0.188545 0.127945 0.132011 0.314178 0.751657 -0.118178 -0.119422 -0.905314 -0.410234 0.019838 0.019519 -0.000546
polarizability: 2.00659746e+02 -2.69266892e+01 1.55446918e+02 2.89441522e-01 2.41176202e-01 9.41843069e+01
1716.lowfreq: -41.2645 -9.2059 -0.0020 -0.0009 0.0016 6.5748 10.9874 67.6540 76.5684
frequency: -41.2521 67.6447 76.5454 125.4215 194.7146 259.3571 282.9511 291.4649 342.7929 356.4314 397.4164 401.4340 491.5510 594.7164 608.9662 620.2216 658.1522 699.7977 744.1307 792.2170 810.8178 839.1773 850.0653 923.2358 971.5264 973.7149 988.5339 997.6286 1028.5412 1079.0001 1133.7712 1174.0103 1187.6889 1230.5626 1311.1223 1338.8422 1372.6987 1429.3292 1469.6142 1519.0592 1585.5993 1610.7378 3127.5910 3134.5796 3145.4540 3154.9834 3168.2055 3168.3634
redmass: 4.3818 7.5407 7.8055 11.2024 8.3496 7.4032 10.6645 4.1225 17.5160 20.2281 3.0191 6.5516 4.5365 5.9588 6.4274 8.2475 5.3135 1.9357 2.1248 4.7154 4.9033 1.4378 1.2458 1.4251 8.0683 1.3884 5.8498 1.3394 2.1684 1.5964 2.8462 1.0533 1.1138 1.6406 1.3505 4.1476 7.5735 2.1879 2.5615 6.3173 6.0481 6.2256 1.0847 1.0880 1.0928 1.0971 1.0931 1.1015
irintensity: 0.1120 0.9049 0.0154 0.0068 2.1361 0.0024 6.6833 1.1632 9.7510 0.1533 0.3933 4.6963 3.6430 14.8648 0.1311 20.0545 0.2001 35.3669 58.9744 22.5940 9.3491 31.5175 1.0183 0.2625 25.0096 0.0668 1.9302 0.0326 10.3581 7.5772 7.7098 0.0048 1.4324 1.6706 0.4617 57.9114 0.1210 9.3992 17.8512 24.3784 1.2272 0.3254 0.5642 0.5606 16.7970 31.6679 1.1789 20.7911
temp: 298.150 k
press: 1.00000 atm
elementType: 16 16 16 6 6 6 6 6 6 6 6 6 1 1 1 1 1 1
symmnumber: 1
zpe: 315397.7 jmol-1
zpe.correction: 0.120129 hartree
zpe.thermalcorrener: 0.130204 hartree
zpe.thermalcorrenthalpy: 0.131148 hartree
zpe.thermalcorrgfe: 0.083198 hartree
zpe.sumelectzpe: -1539.898417 hartree
zpe.sumelectthermal: -1539.888342 hartree
zpe.sumelectthermalent: -1539.887397 hartree
zpe.sumelectthermalfe: -1539.935348 hartree
dipole: -1.7086 -3.0177 0.0356
dipole: 3.4680
quadrupole: -83.6901 -95.5775 -87.3410
quadrupole: -1.4823 0.0121 0.3068
quadrupole: 5.1794 -6.7080 1.5286 -1.4823 0.0121 0.3068
hfenergy: -1540.0185454 hartree
pointgroup: C01[X(C9H6S3)]
dipole: -0.7219608 1.1568464 0.0459506 debye
dipolederiv: -0.2441445 0.0271319 -0.0001108 0.3239462 0.6141747 0.0251876 0.0146758 0.0239365 0.0621203 -0.4628374 -0.3421488 -0.0170734 -0.4105991 -0.4976144 -0.0252307 -0.0244489 -0.0259629 0.0560373 -0.2995121 -0.3095442 -0.0138501 -0.2250514 -0.6225032 -0.0249195 -0.0120768 -0.0258268 -0.0671351 0.1506349 -0.0498503 -0.0023895 0.0442735 -0.0473177 -0.0017203 0.0015129 -0.0038489 0.0360301 0.2333408 0.0199993 0.001793 -0.0049396 -0.6402368 -0.0306313 -0.0001183 -0.0299777 0.0286734 -0.0797546 0.0195135 -0.0905477 -0.0095993 -0.0890863 0.0142625 0.0765585 0.0008926 0.0503174 -0.0782606 0.0158031 0.090113 -0.0065521 -0.0916938 -0.0189433 -0.0801512 -0.0082496 0.0494067 0.3772074 0.0953686 0.0062482 0.1128388 0.7227904 0.0399421 0.0083018 0.0417333 -0.2009083 0.3754221 0.4466605 0.0224512 0.1407776 0.2860612 0.0212072 0.0112144 0.0225981 -0.1992658 -0.0599931 0.0188849 0.1061085 0.0231407 -0.13313 0.0093228 0.0977496 0.0043998 0.0749424 -0.0626673 0.0230616 -0.1054182 0.0275166 -0.1329014 -0.0169233 -0.1000103 -0.011747 0.0712572 0.1215805 0.0326124 0.001826 0.0249385 -0.1509981 -0.0019644 0.0040007 -0.0017988 -0.0457795 0.0527021 -0.0171665 0.0919705 -0.0202044 0.1187302 0.0032392 0.0828989 0.0048498 -0.0271793 0.0545714 -0.0137162 -0.0927493 -0.0161495 0.1196989 0.0013669 -0.0820685 0.0028176 -0.029864 0.0426868 0.0655161 0.0024973 0.0528421 0.0897969 -0.003562 0.0034667 -0.0040297 0.1811803 0.0085032 -0.0041202 -0.0833375 -0.0138204 0.1495981 -0.0034831 -0.1026934 -0.0009779 -0.0659619 0.0062414 -0.0079413 0.0841487 -0.0180315 0.1493563 0.0117423 0.1029517 0.0098609 -0.0634144 -0.1357211 -0.0200645 -0.0016799 -0.0253269 0.155275 0.0011073 -0.0017637 0.0013309 0.0895433 unknown
polarizability: 198.2942396|28.6986545|157.5893908|1.6635714|3.7822473|94.4073407 unknown
InChI: InChI=1S/C9H6S3/c10-9-8(6-11-12-9)7-4-2-1-3-5-7/h1-6H
charge 0 multiplicity 1
18 atoms
S  3.481665 -0.639686 -0.015138
S  3.308716 1.705382 0.086856
S  1.220753 -2.532644 -0.108656
C  -0.60566 0.204852 0.003021
C  0.889598 0.31024 0.013927
C  -1.311135 0.168829 -1.226719
C  -1.325735 0.119786 1.221827
C  1.698394 -0.895044 -0.035303
C  1.527951 1.537219 0.070974
C  -2.71966 0.059561 -1.236074
C  -2.734302 0.010239 1.21021
C  -3.434168 -0.019219 -0.018227
H  -0.756265 0.220858 -2.16994
H  -0.781755 0.133116 2.172729
H  0.980666 2.484322 0.10968
H  -3.256908 0.032902 -2.190462
H  -3.282712 -0.055426 2.156328
H  -4.526343 -0.106487 -0.026531
