program: Orca
programVersion: 6.1.x
elementType: C C C C C C H H H H H C H H H C C C C H C H C H H H C
charge: 1
multiplicity: 1
keywords: opt freq wb97x-d3bj def2-tzvp(-f) def2/J tightscf tightopt
frequency: 0.00 0.00 0.00 0.00 0.00 0.00 30.00 44.45 60.83 122.59 185.52 192.51 320.43 356.40 402.06 409.47 445.59 460.83 506.86 562.13 573.38 624.53 634.46 672.55 714.03 777.78 794.11 803.14 812.79 864.28 868.37 955.67 970.43 985.19 1004.27 1011.40 1024.72 1028.17 1030.29 1033.35 1054.07 1062.20 1065.13 1111.18 1121.16 1136.84 1177.25 1193.10 1203.76 1210.56 1215.17 1228.17 1253.15 1302.80 1331.94 1371.65 1378.13 1389.65 1480.37 1501.79 1510.85 1525.57 1545.47 1581.87 1635.82 1666.31 1668.58 1674.20 3126.98 3185.93 3200.92 3202.17 3205.07 3216.57 3218.93 3220.49 3229.87 3234.92 3238.54 3243.55 3249.02
frequency: 30.00 44.45 60.83 122.59 185.52 192.51 320.43 356.40 402.06 409.47 445.59 460.83 506.86 562.13 573.38 624.53 634.46 672.55 714.03 777.78 794.11 803.14 812.79 864.28 868.37 955.67 970.43 985.19 1004.27 1011.40 1024.72 1028.17 1030.29 1033.35 1054.07 1062.20 1065.13 1111.18 1121.16 1136.84 1177.25 1193.10 1203.76 1210.56 1215.17 1228.17 1253.15 1302.80 1331.94 1371.65 1378.13 1389.65 1480.37 1501.79 1510.85 1525.57 1545.47 1581.87 1635.82 1666.31 1668.58 1674.20 3126.98 3185.93 3200.92 3202.17 3205.07 3216.57 3218.93 3220.49 3229.87 3234.92 3238.54 3243.55 3249.02
formula: C14H13
InChI: InChI=1/C14H13/c1-3-7-13(8-4-1)11-12-14-9-5-2-6-10-14/h1-11H,12H2
27 atoms
C  -1.032609 -3.669216 0.540929
C  -0.271811 -3.738379 -0.62157
C  0.63254 -2.730797 -0.918795
C  0.789702 -1.659453 -0.039981
C  0.006245 -1.577713 1.109598
C  -0.892779 -2.590778 1.406914
H  -1.73777 -4.459104 0.772132
H  -0.378999 -4.582144 -1.292859
H  1.237655 -2.791453 -1.817734
H  0.109296 -0.732097 1.782015
H  -1.485807 -2.538451 2.312247
C  1.795323 -0.541878 -0.361024
H  2.272701 -0.154748 0.534877
H  2.545562 -0.908866 -1.061291
H  0.526722 0.080017 -1.998472
C  0.277795 1.533754 -0.476978
C  -0.723138 2.187222 -1.241893
C  0.669094 2.082338 0.772596
C  -1.312153 3.340212 -0.775081
H  -1.017835 1.764453 -2.196386
C  0.076387 3.233789 1.229017
H  1.440364 1.601815 1.360876
C  -0.911214 3.857035 0.456794
H  -2.07648 3.842594 -1.354541
H  0.371313 3.664198 2.177933
H  -1.372918 4.767061 0.825176
C  0.860907 0.38135 -1.007439
totalener: -541.41905957137874 hartree
nucrepener: 776.88066367401541 hartree
electener: -1318.29969554039280 hartree
oneelecener: -2254.50990015114166 hartree
twoeener: 936.21020461074875 hartree
kineticenergy: 538.71679365050841 hartree
exchangeener: -51.531810014632 hartree
correlationener: -3.936877692820 hartree
xcener: -55.468687707452 hartree
dispersion: -0.062117857 hartree
dispersion: -0.062379318 hartree
dispersion: -0.062392850 hartree
energy: -286.3691 -284.7276 -284.7028 -284.6833 -284.6666 -284.3630 -284.0916 -284.0519 -283.9968 -283.3103 -283.2587 -283.0232 -283.0054 -282.9881 -32.3003 -31.2741 -30.2700 -28.9031 -28.7593 -27.5998 -27.0778 -25.7119 -24.6746 -23.6495 -23.5527 -22.9476 -22.0584 -21.0154 -20.8281 -20.3564 -19.7540 -19.4589 -19.2191 -18.9326 -18.6899 -18.2982 -18.0493 -17.7338 -17.5594 -17.1285 -16.7919 -16.5878 -15.8603 -15.7075 -14.7192 -14.2068 -13.0209 -12.8515 -5.8457 -2.5453 -2.0583 -1.6163 -1.0727 -0.4432 -0.2244 0.1814 0.7070 0.8195 1.2067 electronvolt
chargesum: 1.0000000
charge: -0.075248 -0.069786 -0.280786 0.432687 -0.251359 -0.080552 0.126779 0.124263 0.119817 0.108011 0.120220 -0.349789 0.184395 0.189331 0.173468 0.430575 -0.212080 -0.246712 -0.079507 0.139987 -0.073278 0.137464 -0.013838 0.143188 0.141807 0.151591 0.009350
charge: -0.084478 -0.097913 -0.088528 -0.118614 -0.086820 -0.101487 0.146038 0.145788 0.144052 0.140638 0.144483 -0.148843 0.144893 0.159236 0.166616 -0.136989 -0.006709 -0.019013 -0.090485 0.154396 -0.089659 0.149536 -0.011712 0.153091 0.152583 0.155961 0.123938
qa: -0.0752 -0.0698 -0.2808 0.4327 -0.2514 -0.0806 0.1268 0.1243 0.1198 0.1080 0.1202 -0.3498 0.1844 0.1893 0.1735 0.4306 -0.2121 -0.2467 -0.0795 0.1400 -0.0733 0.1375 -0.0138 0.1432 0.1418 0.1516 0.0093
va: 3.9954 3.9809 4.1016 3.6378 4.1024 3.9943 0.9648 0.9677 0.9718 0.9696 0.9687 3.8838 0.9511 0.9611 0.9529 3.7361 4.0381 4.0397 3.9653 0.9706 3.9821 0.9763 3.9743 0.9660 0.9670 0.9597 3.7052
dispersion: -0.062390294 hartree
energy: -541.482624644475 hartree
dipole: 0.406425010 -0.275986905 0.130438105 -0.475675656 1.938533893 1.462858237 -0.020795736 -0.394231107 -0.415026843
dipolemethod: SCF
magnitude: 1.526176792 au
magnitude: 3.879233117 debye
temp: 298.15 k
press: 1.00 atm
zeropoint: 0.22930279 hartree
thermalvibcorrection: 0.00847891 hartree
thermalrotcorrection: 0.00141627 hartree
thermaltrasncorrection: 0.00141627 hartree
thermaltotal: -541.24201040 hartree
thermalcorr: 0.01131145 hartree
nonthermalcorr: 0.22930279 hartree
totalcorr: 0.24061424 hartree
thermalcorrenthalpy: 0.00094421 hartree
totalenthalpy: -541.24106619 hartree
vibrat: 0.01450700 hartree
rotat: 0.01507406 hartree
transl: 0.01971357 hartree
total: 0.04929462 hartree
totalentropycorr: -0.04929462 hartree
gibbsenthalpy: -541.29036082 hartree
gibbsminuselec: 0.19226383 hartree
