program: Orca
programVersion: 6.1.x
elementType: C C C C C C H H H C H H H C C C C H C H C H H H C H C H H H
charge: 1
multiplicity: 1
keywords: opt freq wb97x-d3bj def2-tzvp(-f) def2/J tightscf tightopt
frequency: 0.00 0.00 0.00 0.00 0.00 0.00 23.35 41.44 50.98 58.40 122.96 169.36 182.42 217.19 293.14 336.87 396.65 403.63 437.66 456.44 476.05 521.73 542.14 566.96 582.65 625.34 675.08 714.51 738.06 801.08 807.13 815.25 864.91 906.97 925.73 949.62 972.47 984.64 1009.65 1015.83 1022.16 1024.65 1026.94 1035.35 1054.90 1060.53 1077.18 1117.99 1122.64 1142.20 1167.38 1200.05 1203.34 1208.83 1219.67 1247.22 1272.50 1300.75 1328.27 1358.12 1377.87 1385.87 1433.73 1472.87 1481.16 1495.16 1502.33 1514.47 1526.75 1545.69 1579.29 1637.41 1660.38 1670.24 1682.38 3074.84 3130.60 3142.49 3160.30 3187.75 3192.78 3203.79 3207.38 3209.40 3216.18 3220.18 3231.33 3234.24 3242.95 3248.39
frequency: 23.35 41.44 50.98 58.40 122.96 169.36 182.42 217.19 293.14 336.87 396.65 403.63 437.66 456.44 476.05 521.73 542.14 566.96 582.65 625.34 675.08 714.51 738.06 801.08 807.13 815.25 864.91 906.97 925.73 949.62 972.47 984.64 1009.65 1015.83 1022.16 1024.65 1026.94 1035.35 1054.90 1060.53 1077.18 1117.99 1122.64 1142.20 1167.38 1200.05 1203.34 1208.83 1219.67 1247.22 1272.50 1300.75 1328.27 1358.12 1377.87 1385.87 1433.73 1472.87 1481.16 1495.16 1502.33 1514.47 1526.75 1545.69 1579.29 1637.41 1660.38 1670.24 1682.38 3074.84 3130.60 3142.49 3160.30 3187.75 3192.78 3203.79 3207.38 3209.40 3216.18 3220.18 3231.33 3234.24 3242.95 3248.39
formula: C15H15
InChI: InChI=1/C15H15/c1-13-6-5-9-15(12-13)11-10-14-7-3-2-4-8-14/h2-10,12H,11H2,1H3
30 atoms
C  -0.980298 -3.123372 -1.098316
C  0.136501 -3.370412 -0.29389
C  0.492267 -2.411398 0.644986
C  -0.260927 -1.24541 0.795741
C  -1.352117 -1.001731 -0.032276
C  -1.718883 -1.956534 -0.970462
H  1.348197 -2.58685 1.290226
H  -1.9216 -0.083227 0.06208
H  -2.580094 -1.787569 -1.606102
C  0.147205 -0.201515 1.849643
H  -0.714727 0.281206 2.301297
H  0.768244 -0.667773 2.613778
H  1.890507 0.232737 0.648683
C  0.559853 1.859207 0.362322
C  1.428966 2.420789 -0.606874
C  -0.625559 2.551777 0.719515
C  1.123488 3.625124 -1.200063
H  2.334748 1.88811 -0.876004
C  -0.921224 3.753435 0.123148
H  -1.292165 2.141228 1.467214
C  -0.049286 4.284716 -0.834156
H  1.78383 4.057684 -1.941179
H  -1.82082 4.292722 0.392712
H  -0.29098 5.234649 -1.299046
C  0.930067 0.64545 0.950983
H  -1.271418 -3.861455 -1.838587
C  0.913062 -4.652248 -0.437144
H  1.824118 -4.636551 0.162101
H  1.189225 -4.823076 -1.479777
H  0.308275 -5.502535 -0.112628
totalener: -580.77026804767877 hartree
nucrepener: 876.66372678383050 hartree
electener: -1457.43401575035409 hartree
oneelecener: -2505.31933420703717 hartree
twoeener: 1047.88531845668308 hartree
kineticenergy: 577.83366832248498 hartree
exchangeener: -55.401345069002 hartree
correlationener: -4.256658622438 hartree
xcener: -59.658003691441 hartree
dispersion: -0.067746228 hartree
dispersion: -0.068033280 hartree
dispersion: -0.068037889 hartree
dispersion: -0.068035175 hartree
energy: -286.2942 -284.6155 -284.6001 -284.5728 -284.5448 -284.2977 -283.9961 -283.9573 -283.9372 -283.1870 -283.1782 -283.0822 -282.9339 -282.8697 -282.1787 -32.2099 -31.2222 -30.2369 -28.8534 -28.6939 -27.9686 -27.0301 -25.6673 -25.4190 -24.5653 -23.5563 -23.2054 -22.5389 -21.9382 -20.8387 -20.5815 -20.2678 -19.7606 -19.3476 -19.1266 -18.9173 -18.5026 -18.1354 -17.7464 -17.5630 -17.5233 -17.4443 -17.0034 -16.6267 -16.3904 -16.1241 -15.5696 -15.4627 -14.5816 -14.1054 -12.8655 -12.5009 -5.7372 -2.4568 -2.0069 -1.4542 -0.9921 -0.3887 -0.1598 0.2405 0.7587 0.8776 1.1002 electronvolt
chargesum: 1.0000000
charge: -0.222030 0.363737 -0.447884 0.471293 -0.259438 -0.064878 0.114168 0.105403 0.117356 -0.347494 0.185839 0.185504 0.172292 0.436845 -0.215042 -0.250358 -0.080081 0.137975 -0.073582 0.136690 -0.016728 0.141698 0.140381 0.149900 0.002412 0.123811 -0.435199 0.130158 0.144773 0.152477
charge: -0.063338 -0.132695 -0.072488 -0.115996 -0.090756 -0.101476 0.144068 0.140299 0.144347 -0.147479 0.144757 0.158294 0.166466 -0.137567 -0.009949 -0.021913 -0.091476 0.153706 -0.090617 0.149147 -0.015786 0.152494 0.152057 0.155284 0.122681 0.147467 -0.217206 0.120203 0.127236 0.130235
qa: -0.2220 0.3637 -0.4479 0.4713 -0.2594 -0.0649 0.1142 0.1054 0.1174 -0.3475 0.1858 0.1855 0.1723 0.4368 -0.2150 -0.2504 -0.0801 0.1380 -0.0736 0.1367 -0.0167 0.1417 0.1404 0.1499 0.0024 0.1238 -0.4352 0.1302 0.1448 0.1525
va: 4.0127 3.8053 4.1152 3.5897 4.1031 3.9408 0.9779 0.9702 0.9695 3.8830 0.9493 0.9635 0.9529 3.7323 4.0399 4.0404 3.9644 0.9708 3.9803 0.9761 3.9760 0.9662 0.9671 0.9600 3.7135 0.9656 3.8689 0.9683 0.9581 0.9562
dispersion: -0.068035176 hartree
energy: -580.839566499912 hartree
dipole: 1.499304284 -0.981742494 0.517561791 -6.057533973 7.717923875 1.660389902 -0.163055590 0.364589295 0.201533705
dipolemethod: SCF
magnitude: 1.750822855 au
magnitude: 4.450238031 debye
temp: 298.15 k
press: 1.00 atm
zeropoint: 0.25685232 hartree
thermalvibcorrection: 0.01032903 hartree
thermalrotcorrection: 0.00141627 hartree
thermaltrasncorrection: 0.00141627 hartree
thermaltotal: -580.56955261 hartree
thermalcorr: 0.01316157 hartree
nonthermalcorr: 0.25685232 hartree
totalcorr: 0.27001389 hartree
thermalcorrenthalpy: 0.00094421 hartree
totalenthalpy: -580.56860840 hartree
vibrat: 0.01805725 hartree
rotat: 0.01532669 hartree
transl: 0.01981914 hartree
total: 0.05320308 hartree
totalentropycorr: -0.05320308 hartree
gibbsenthalpy: -580.62181148 hartree
gibbsminuselec: 0.21775502 hartree
