program: Orca
programVersion: 6.1.x
elementType: C C C C C C H H H H C H H H C C C C H C H C H H H C C C C H H H H H
charge: 1
multiplicity: 1
keywords: opt freq wb97x-d3bj def2-tzvp(-f) def2/J tightscf tightopt
frequency: 0.00 0.00 0.00 0.00 0.00 0.00 29.12 30.23 58.21 96.52 101.49 160.69 182.78 208.78 248.12 305.66 337.09 364.46 409.95 416.27 434.15 452.04 513.80 548.38 553.27 601.38 636.24 636.76 674.98 717.33 757.91 782.18 786.96 808.54 821.62 842.78 852.04 867.90 871.58 929.86 942.06 957.67 964.70 995.35 1002.50 1003.95 1029.10 1030.68 1031.45 1034.29 1037.27 1066.63 1074.68 1078.82 1105.64 1115.16 1133.60 1137.30 1151.16 1172.47 1189.79 1214.62 1219.03 1222.05 1233.13 1242.83 1269.91 1289.40 1326.57 1355.90 1370.07 1398.33 1442.27 1452.85 1488.62 1502.56 1505.14 1530.72 1531.85 1544.98 1563.22 1605.33 1670.23 1674.40 1686.94 3177.90 3180.92 3189.46 3199.61 3206.97 3210.90 3216.18 3217.46 3219.40 3221.63 3228.97 3234.93 3237.62 3237.90 3262.54 3274.84 3280.99
frequency: 29.12 30.23 58.21 96.52 101.49 160.69 182.78 208.78 248.12 305.66 337.09 364.46 409.95 416.27 434.15 452.04 513.80 548.38 553.27 601.38 636.24 636.76 674.98 717.33 757.91 782.18 786.96 808.54 821.62 842.78 852.04 867.90 871.58 929.86 942.06 957.67 964.70 995.35 1002.50 1003.95 1029.10 1030.68 1031.45 1034.29 1037.27 1066.63 1074.68 1078.82 1105.64 1115.16 1133.60 1137.30 1151.16 1172.47 1189.79 1214.62 1219.03 1222.05 1233.13 1242.83 1269.91 1289.40 1326.57 1355.90 1370.07 1398.33 1442.27 1452.85 1488.62 1502.56 1505.14 1530.72 1531.85 1544.98 1563.22 1605.33 1670.23 1674.40 1686.94 3177.90 3180.92 3189.46 3199.61 3206.97 3210.90 3216.18 3217.46 3219.40 3221.63 3228.97 3234.93 3237.62 3237.90 3262.54 3274.84 3280.99
formula: C17H17
InChI: InChI=1/C17H17/c1-2-4-15(5-3-1)16-12-17(16)10-8-14(9-11-17)13-6-7-13/h1-5,8-11,13,16H,6-7,12H2
34 atoms
C  -0.31102 -2.489086 0.30993
C  0.914613 -2.38154 -0.385706
C  1.644991 -1.230968 -0.322148
C  1.189299 -0.115298 0.435173
C  -0.049233 -0.230279 1.124213
C  -0.769963 -1.387347 1.066047
H  1.280803 -3.215141 -0.971307
H  2.589561 -1.155433 -0.851799
H  -0.424968 0.621843 1.679147
H  -1.712745 -1.467477 1.593661
C  2.23681 0.944239 0.916701
H  1.989972 1.371438 1.879455
H  3.26025 0.608282 0.812571
H  1.98494 1.191454 -1.210185
C  0.430599 2.382403 -0.25983
C  -0.397948 2.460515 -1.379734
C  0.233077 3.259303 0.805039
C  -1.423666 3.390324 -1.426081
H  -0.238379 1.786746 -2.215732
C  -0.792948 4.193215 0.755209
H  0.891169 3.239912 1.666327
C  -1.624374 4.255554 -0.355548
H  -2.064111 3.44621 -2.298406
H  -0.935438 4.880505 1.580846
H  -2.423026 4.987282 -0.393081
C  1.51538 1.375519 -0.25104
C  -1.121642 -3.702283 0.26327
C  -1.16193 -4.543305 -1.007825
C  -0.444945 -5.065831 0.175267
H  -2.037967 -3.659386 0.837637
H  -0.586902 -4.184679 -1.852253
H  -2.126822 -4.963727 -1.259275
H  -0.905388 -5.853556 0.757014
H  0.637678 -5.077622 0.168885
totalener: -658.21696099680867 hartree
nucrepener: 1084.63736678030637 hartree
electener: -1742.85433263698906 hartree
oneelecener: -3021.95690237352164 hartree
twoeener: 1279.10256973653259 hartree
kineticenergy: 654.87099253770782 hartree
exchangeener: -62.833478251782 hartree
correlationener: -4.845428482869 hartree
xcener: -67.678906734650 hartree
dispersion: -0.077155283 hartree
dispersion: -0.077685055 hartree
dispersion: -0.077699481 hartree
dispersion: -0.077696302 hartree
energy: -285.1659 -284.9539 -284.8812 -284.5870 -284.5716 -284.4809 -283.8414 -283.7685 -283.6010 -283.4377 -283.2212 -283.2119 -283.0117 -282.9532 -282.7547 -282.7413 -282.7280 -32.7267 -31.5381 -30.6593 -30.2143 -28.7032 -27.9691 -27.3682 -27.2520 -24.8124 -24.7250 -24.4044 -23.3601 -23.2840 -23.0118 -22.6055 -21.5499 -21.2133 -20.8700 -19.9497 -19.6985 -19.5731 -19.0426 -18.9615 -18.8724 -18.5240 -18.2823 -18.0740 -17.7469 -17.3711 -17.0007 -16.6680 -16.4511 -16.3790 -16.2105 -15.6605 -15.6018 -15.3549 -14.7823 -14.0896 -13.6221 -12.7605 -12.4181 -4.7936 -2.2427 -1.6342 -1.4224 -0.2615 0.0163 0.2315 0.3807 0.4972 0.6695 0.8151 electronvolt
chargesum: 1.0000000
charge: 0.482470 -0.262433 -0.237490 0.327820 -0.128175 -0.330393 0.139301 0.140860 0.150581 0.124267 -0.152815 0.156118 0.161341 0.158531 0.422522 -0.292993 -0.294212 -0.074039 0.107550 -0.076807 0.111805 -0.080268 0.119108 0.119550 0.121993 -0.092778 -0.163149 -0.140899 -0.141294 0.112240 0.121320 0.133644 0.134280 0.122445
charge: -0.017564 -0.077586 -0.013164 -0.125156 0.003352 -0.070993 0.152051 0.156332 0.160895 0.152660 -0.071747 0.146534 0.147710 0.164409 -0.137452 -0.082379 -0.094315 -0.102811 0.141924 -0.105483 0.139689 -0.091652 0.143519 0.143606 0.144317 -0.025214 -0.146484 -0.152871 -0.151967 0.148011 0.126567 0.133990 0.134245 0.127025
qa: 0.4825 -0.2624 -0.2375 0.3278 -0.1282 -0.3304 0.1393 0.1409 0.1506 0.1243 -0.1528 0.1561 0.1613 0.1585 0.4225 -0.2930 -0.2942 -0.0740 0.1075 -0.0768 0.1118 -0.0803 0.1191 0.1195 0.1220 -0.0928 -0.1631 -0.1409 -0.1413 0.1122 0.1213 0.1336 0.1343 0.1224
va: 3.6612 3.9425 4.0770 3.9016 3.9705 4.0253 0.9784 0.9741 0.9608 0.9778 3.8521 0.9723 0.9688 0.9482 3.7238 4.0645 4.0307 3.9435 0.9701 3.9784 0.9745 3.9981 0.9670 0.9683 0.9659 3.8501 3.8184 3.8688 3.8702 0.9550 0.9746 0.9813 0.9815 0.9747
dispersion: -0.077695308 hartree
energy: -658.295978926943 hartree
dipole: -0.769008232 1.360533300 0.591525069 -7.407692321 6.393742201 -1.013950119 -0.466899606 0.671142629 0.204243023
dipolemethod: SCF
magnitude: 1.191516665 au
magnitude: 3.028594677 debye
temp: 298.15 k
press: 1.00 atm
zeropoint: 0.29259081 hartree
thermalvibcorrection: 0.01135755 hartree
thermalrotcorrection: 0.00141627 hartree
thermaltrasncorrection: 0.00141627 hartree
thermaltotal: -657.98919802 hartree
thermalcorr: 0.01419009 hartree
nonthermalcorr: 0.29259081 hartree
totalcorr: 0.30678091 hartree
thermalcorrenthalpy: 0.00094421 hartree
totalenthalpy: -657.98825381 hartree
vibrat: 0.01962135 hartree
rotat: 0.01568660 hartree
transl: 0.01999640 hartree
total: 0.05530435 hartree
totalentropycorr: -0.05530435 hartree
gibbsenthalpy: -658.04355817 hartree
gibbsminuselec: 0.25242076 hartree
