program: Orca
programVersion: 6.1.x
elementType: C C C C C C H H H H C H H H C C C C H C H C H H H C C H H H
charge: 1
multiplicity: 1
keywords: opt freq wb97x-d3bj def2-tzvp(-f) def2/J tightscf tightopt
frequency: 0.00 0.00 0.00 0.00 0.00 0.00 21.73 29.78 34.65 58.28 90.17 172.49 178.70 235.25 314.82 354.83 375.16 408.47 411.48 430.51 492.68 504.21 539.11 578.76 635.75 643.49 717.12 719.63 745.69 782.60 802.42 842.92 850.45 858.40 868.57 950.78 961.43 993.51 1000.37 1019.09 1025.09 1027.98 1029.08 1030.41 1034.09 1063.09 1066.25 1110.67 1129.80 1154.90 1189.17 1197.63 1211.39 1214.57 1225.86 1260.05 1273.47 1309.97 1328.35 1359.45 1372.33 1398.40 1420.75 1475.55 1485.27 1493.47 1499.31 1510.95 1525.18 1548.67 1602.09 1608.73 1669.94 1675.37 1678.54 3068.05 3113.04 3137.33 3179.38 3179.47 3193.31 3196.33 3201.58 3216.07 3217.23 3221.50 3227.68 3233.53 3237.19 3245.95
frequency: 21.73 29.78 34.65 58.28 90.17 172.49 178.70 235.25 314.82 354.83 375.16 408.47 411.48 430.51 492.68 504.21 539.11 578.76 635.75 643.49 717.12 719.63 745.69 782.60 802.42 842.92 850.45 858.40 868.57 950.78 961.43 993.51 1000.37 1019.09 1025.09 1027.98 1029.08 1030.41 1034.09 1063.09 1066.25 1110.67 1129.80 1154.90 1189.17 1197.63 1211.39 1214.57 1225.86 1260.05 1273.47 1309.97 1328.35 1359.45 1372.33 1398.40 1420.75 1475.55 1485.27 1493.47 1499.31 1510.95 1525.18 1548.67 1602.09 1608.73 1669.94 1675.37 1678.54 3068.05 3113.04 3137.33 3179.38 3179.47 3193.31 3196.33 3201.58 3216.07 3217.23 3221.50 3227.68 3233.53 3237.19 3245.95
formula: C15H15
InChI: InChI=1/C15H15/c1-13-7-9-15(10-8-13)12-11-14-5-3-2-4-6-14/h2-10,12H,11H2,1H3
30 atoms
C  -0.339889 -3.640578 0.398303
C  0.907009 -3.150825 0.817968
C  1.353262 -1.932795 0.375586
C  0.562771 -1.148373 -0.511574
C  -0.702034 -1.656235 -0.928636
C  -1.13412 -2.872055 -0.479546
H  1.511724 -3.742724 1.494538
H  2.315455 -1.54979 0.698788
H  -1.320181 -1.081306 -1.606349
H  -2.094799 -3.26089 -0.797128
C  1.067052 0.066281 -0.943664
H  2.055769 0.341047 -0.580173
H  1.092081 1.488793 -2.506884
H  -0.5048 0.745736 -2.253189
C  0.102149 2.168285 -0.713013
C  -0.999566 2.025628 0.126918
C  0.95017 3.263556 -0.568456
C  -1.275316 2.994991 1.080587
H  -1.653532 1.164718 0.027538
C  0.675197 4.228735 0.3892
H  1.81065 3.375814 -1.220266
C  -0.437136 4.095485 1.212662
H  -2.143614 2.891632 1.720688
H  1.325371 5.090008 0.488263
H  -0.651774 4.852307 1.958141
C  0.401051 1.091594 -1.761162
C  -0.824875 -4.978499 0.852881
H  -1.884027 -4.939003 1.114767
H  -0.722216 -5.693156 0.029183
H  -0.253221 -5.351097 1.701796
totalener: -580.77669345320010 hartree
nucrepener: 866.77591109505295 hartree
electener: -1447.55257144700499 hartree
oneelecener: -2485.58527287795414 hartree
twoeener: 1038.03270143094915 hartree
kineticenergy: 577.84541613805084 hartree
exchangeener: -55.402142160874 hartree
correlationener: -4.255769367049 hartree
xcener: -59.657911527922 hartree
dispersion: -0.067233066 hartree
dispersion: -0.067576825 hartree
dispersion: -0.067588787 hartree
dispersion: -0.067584337 hartree
dispersion: -0.067582391 hartree
energy: -286.0205 -285.0442 -284.7000 -284.6328 -284.5540 -284.0970 -283.9831 -283.9352 -283.6349 -283.1983 -283.0100 -282.9438 -282.7548 -282.7311 -282.7133 -32.2151 -31.0471 -30.2165 -28.9794 -28.7871 -27.4620 -27.3125 -26.3325 -24.9842 -24.5065 -23.4210 -23.3129 -22.6891 -21.6255 -20.8227 -20.5830 -20.1086 -19.5435 -19.2515 -19.0690 -18.7149 -18.6501 -18.5392 -17.9255 -17.7622 -17.3549 -17.2589 -17.2247 -16.9065 -16.5187 -16.3184 -15.5759 -15.4347 -14.2635 -14.2194 -12.7466 -12.5982 -5.6822 -2.4927 -1.8374 -1.3927 -0.9607 -0.2831 -0.1176 0.1987 0.5133 0.8738 1.0830 electronvolt
chargesum: 1.0000000
charge: 0.376464 -0.207850 -0.187838 0.413418 -0.217177 -0.211846 0.137373 0.138243 0.136376 0.137737 -0.000545 0.168886 0.187467 0.179692 0.430559 -0.250399 -0.278970 -0.082217 0.103879 -0.070773 0.112890 -0.079678 0.115812 0.120581 0.122278 -0.359400 -0.426231 0.162002 0.175198 0.154069
charge: -0.051818 -0.075470 -0.000521 -0.139336 -0.014514 -0.071352 0.153364 0.155298 0.150504 0.153821 0.111000 0.164680 0.159632 0.143368 -0.124789 -0.094447 -0.093802 -0.104811 0.138346 -0.100340 0.142225 -0.092847 0.142726 0.144298 0.144304 -0.153888 -0.200069 0.137383 0.146567 0.130490
qa: 0.3765 -0.2078 -0.1878 0.4134 -0.2172 -0.2118 0.1374 0.1382 0.1364 0.1377 -0.0005 0.1689 0.1875 0.1797 0.4306 -0.2504 -0.2790 -0.0822 0.1039 -0.0708 0.1129 -0.0797 0.1158 0.1206 0.1223 -0.3594 -0.4262 0.1620 0.1752 0.1541
va: 3.8245 3.9636 3.9836 3.7678 3.9741 3.9727 0.9693 0.9723 0.9776 0.9697 3.7233 0.9541 0.9593 0.9495 3.6212 4.0833 4.0895 3.9922 0.9672 3.9747 0.9719 3.9951 0.9691 0.9677 0.9655 3.8980 3.8688 0.9570 0.9540 0.9642
dispersion: -0.067582608 hartree
energy: -580.845474041278 hartree
dipole: -1.231521357 1.605055949 0.373534592 -5.386334203 3.634333235 -1.752000968 0.797729840 -1.049629034 -0.251899194
dipolemethod: SCF
magnitude: 1.809002125 au
magnitude: 4.598117982 debye
temp: 298.15 k
press: 1.00 atm
zeropoint: 0.25674217 hartree
thermalvibcorrection: 0.01040505 hartree
thermalrotcorrection: 0.00141627 hartree
thermaltrasncorrection: 0.00141627 hartree
thermaltotal: -580.57549429 hartree
thermalcorr: 0.01323759 hartree
nonthermalcorr: 0.25674217 hartree
totalcorr: 0.26997976 hartree
thermalcorrenthalpy: 0.00094421 hartree
totalenthalpy: -580.57455008 hartree
vibrat: 0.01842230 hartree
rotat: 0.01536691 hartree
transl: 0.01981914 hartree
total: 0.05360835 hartree
totalentropycorr: -0.05360835 hartree
gibbsenthalpy: -580.62815843 hartree
gibbsminuselec: 0.21731562 hartree
