program: Orca
programVersion: 6.1.x
elementType: C C C C C C H H H H C H H H C C C C H C H C H H H C C H H H
charge: 1
multiplicity: 1
keywords: wb97x-d3bj def2-tzvppd def2/J tightscf defgrid3
formula: C15H15
InChI: InChI=1/C15H15/c1-13-7-9-15(10-8-13)12-11-14-5-3-2-4-6-14/h2-11H,12H2,1H3
30 atoms
C  -0.558236 -3.33383 0.294227
C  0.296265 -3.26276 -0.809228
C  1.139507 -2.181296 -0.9877
C  1.159209 -1.148908 -0.046977
C  0.282933 -1.191528 1.037556
C  -0.551632 -2.280955 1.211847
H  0.301201 -4.069937 -1.5335
H  1.806245 -2.150161 -1.843792
H  0.262337 -0.377635 1.754871
H  -1.2142 -2.316166 2.069578
C  2.107206 0.048795 -0.231382
H  2.437027 0.460666 0.717723
H  2.958096 -0.23241 -0.8494
H  0.949137 0.551762 -1.98514
C  0.318038 1.888522 -0.45878
C  -0.695085 2.40325 -1.302602
C  0.506459 2.452974 0.826558
C  -1.496175 3.439809 -0.875458
H  -0.834328 1.969912 -2.287232
C  -0.295791 3.488346 1.243744
H  1.28798 2.080614 1.476761
C  -1.294907 3.976446 0.394906
H  -2.272731 3.835682 -1.517924
H  -0.154555 3.930558 2.222199
H  -1.922882 4.79407 0.732278
C  1.124059 0.850858 -0.954031
C  -1.447308 -4.528308 0.49865
H  -0.906218 -5.304751 1.047323
H  -2.334648 -4.268669 1.077243
H  -1.761925 -4.954643 -0.454913
totalener: -580.79164708071085 hartree
nucrepener: 881.10323125970945 hartree
electener: -1461.89487885372682 hartree
oneelecener: -2514.15162634972103 hartree
twoeener: 1052.25674749599420 hartree
kineticenergy: 578.10983754640461 hartree
exchangeener: -55.484970912700 hartree
correlationener: -4.262873488369 hartree
xcener: -59.747844401069 hartree
energy: -286.2675 -284.5162 -284.4890 -284.4561 -284.4022 -284.3170 -284.0272 -283.9054 -283.8650 -283.4011 -283.3794 -283.3526 -282.9635 -282.9506 -282.2247 -32.1115 -31.2456 -30.2318 -28.8337 -28.5717 -27.6109 -27.5243 -25.8383 -24.9372 -24.4307 -23.6542 -23.3348 -22.6063 -21.8639 -20.7779 -20.4704 -20.1396 -19.7262 -19.2132 -19.0039 -18.9090 -18.6364 -18.0968 -17.9660 -17.6252 -17.6020 -17.3417 -16.8651 -16.5145 -16.3724 -16.2010 -15.6568 -15.4881 -14.5127 -14.0013 -13.0817 -12.5009 -5.6285 -2.4149 -2.0494 -1.6901 -1.5598 -1.1885 -1.1819 -0.9516 -0.6486 -0.4506 -0.3615 electronvolt
chargesum: 1.0000000
charge: 0.484625 -0.072473 -0.228930 0.469628 0.201348 -0.284990 -0.064164 -0.069314 -0.073952 -0.082737 0.603075 0.079798 0.081776 -0.014219 0.572302 -0.148554 0.073762 -0.113420 -0.061229 -0.329421 -0.066233 0.105757 0.021664 0.012051 0.045193 0.101217 -0.585680 0.140266 0.098736 0.104118
charge: -0.166100 0.071264 0.068078 -0.166003 0.070672 0.072193 0.023228 0.026032 0.020689 0.021944 0.060414 0.024810 0.042004 0.051585 -0.152528 0.107575 0.098119 0.065707 0.030576 0.066880 0.018482 0.095605 0.021090 0.021284 0.026722 0.196749 0.179913 0.008794 -0.003572 -0.002206
qa: 0.4846 -0.0725 -0.2289 0.4696 0.2013 -0.2850 -0.0642 -0.0693 -0.0740 -0.0827 0.6031 0.0798 0.0818 -0.0142 0.5723 -0.1486 0.0738 -0.1134 -0.0612 -0.3294 -0.0662 0.1058 0.0217 0.0121 0.0452 0.1012 -0.5857 0.1403 0.0987 0.1041
va: 2.2972 3.3103 3.4917 2.5150 3.3490 3.1905 0.9580 0.9679 0.8397 0.9674 2.8224 0.9485 1.0067 0.9294 1.5245 3.2272 3.2555 3.3675 0.9761 3.4821 0.9052 3.3378 0.9445 0.9528 0.9212 3.3950 3.7344 1.0235 1.0406 1.0390
dispersion: -0.068142969 hartree
energy: -580.859790049940 hartree
dipole: -1.725885759 1.858502451 0.132616692 -5.775320474 7.166066653 1.390746179 0.679229091 -1.038584487 -0.359355396
dipolemethod: SCF
magnitude: 1.442531948 au
magnitude: 3.666624821 debye
