program: Orca
programVersion: 6.1.x
elementType: C C C C C C H H H C H H H C C C C H C H C H H H C N C C H H H H H H F
charge: 1
multiplicity: 1
keywords: wb97x-d3bj def2-tzvppd def2/J tightscf defgrid3
formula: C16H17FN
InChI: InChI=1/C16H17FN/c1-18(2)15-8-9-16(11-14(15)17)10-13(16)12-6-4-3-5-7-12/h3-9,11,13H,10H2,1-2H3
35 atoms
C  0.022476 -2.436818 -0.104407
C  1.38971 -2.158229 -0.46954
C  1.963844 -0.969348 -0.190462
C  1.247894 0.102984 0.447501
C  -0.139141 -0.149249 0.754851
C  -0.705009 -1.336889 0.496795
H  1.981425 -2.937287 -0.925424
H  3.008806 -0.813672 -0.439105
H  -0.755711 0.644342 1.16172
C  2.046527 1.067405 1.363964
H  1.501324 1.393714 2.239525
H  3.075561 0.783937 1.541397
H  2.423331 1.578174 -0.711807
C  0.571561 2.586145 -0.135583
C  -0.084991 2.647606 -1.364635
C  0.208265 3.465851 0.878321
C  -1.100394 3.567466 -1.570679
H  0.202218 1.969181 -2.162236
C  -0.809756 4.390322 0.670798
H  0.730955 3.452587 1.828212
C  -1.467007 4.439264 -0.549806
H  -1.605452 3.609496 -2.528786
H  -1.081529 5.077752 1.463445
H  -2.259089 5.161164 -0.711456
C  1.657293 1.581601 0.055774
N  -0.509018 -3.623314 -0.330981
C  -1.776518 -4.101059 0.253259
C  0.197079 -4.618706 -1.150017
H  -1.694773 -5.181377 0.358058
H  -1.937779 -3.66957 1.234773
H  -2.617183 -3.863346 -0.399443
H  -0.53541 -5.339609 -1.505703
H  0.65767 -4.147449 -2.016124
H  0.954227 -5.141834 -0.560807
F  -2.019691 -1.492847 0.733493
totalener: -774.80844975184687 hartree
nucrepener: 1263.27056482837497 hartree
electener: -2038.07901695233409 hartree
oneelecener: -3540.03424512418815 hartree
twoeener: 1501.95522817185406 hartree
kineticenergy: 771.38611208084626 hartree
exchangeener: -71.140246080596 hartree
correlationener: -5.330585495265 hartree
xcener: -76.470831575861 hartree
energy: -677.9388 -398.0876 -286.2393 -286.0572 -284.5636 -284.5077 -284.3795 -284.2936 -284.2707 -284.1769 -284.0284 -283.9463 -283.0303 -282.5885 -282.5576 -282.4148 -282.4024 -282.3591 -40.8853 -34.6596 -32.3921 -30.6697 -29.9420 -28.7137 -28.0146 -27.4558 -27.1237 -26.8907 -25.4250 -24.5720 -24.2052 -23.7696 -22.8261 -22.2972 -22.0072 -21.5923 -21.3433 -20.6217 -20.5232 -19.8198 -19.6814 -19.4923 -19.4313 -19.2673 -18.6444 -18.3692 -18.2059 -18.0904 -18.0560 -17.6575 -17.5821 -17.3409 -17.0296 -16.9423 -16.6097 -16.3448 -15.7606 -15.5913 -15.1633 -14.8950 -14.0525 -13.0449 -12.3977 -12.0845 -4.3251 -1.9876 -1.6312 -1.4115 -1.0931 -1.0336 -0.9143 -0.7287 -0.4970 -0.4768 -0.2787 electronvolt
chargesum: 1.0000000
charge: 0.399234 -0.293814 -0.862865 1.931161 0.107973 0.041913 -0.078897 -0.093787 -0.010798 -0.176080 0.069639 -0.008577 0.057100 -0.076132 -0.165111 0.396379 -0.168761 -0.017316 -0.218839 -0.067478 -0.023624 0.004878 0.010167 0.023192 0.243179 0.174925 -0.288010 -0.390360 0.155624 0.065383 0.137908 0.135076 0.107553 0.174473 -0.295306
charge: -0.078714 0.110871 0.126455 -0.245461 0.185084 -0.148636 0.004594 0.045906 0.055759 0.171399 0.025935 0.032775 0.053845 -0.169199 0.053266 0.052748 0.034845 0.021065 0.037263 0.012394 0.032427 0.010558 0.011453 0.011000 -0.028359 -0.016735 0.213168 0.196789 0.013968 0.006653 0.025044 0.014956 0.009863 0.027480 0.089540
qa: 0.3992 -0.2938 -0.8629 1.9312 0.1080 0.0419 -0.0789 -0.0938 -0.0108 -0.1761 0.0696 -0.0086 0.0571 -0.0761 -0.1651 0.3964 -0.1688 -0.0173 -0.2188 -0.0675 -0.0236 0.0049 0.0102 0.0232 0.2432 0.1749 -0.2880 -0.3904 0.1556 0.0654 0.1379 0.1351 0.1076 0.1745 -0.2953
va: 3.7125 3.6491 3.6789 0.7186 3.2988 2.2924 0.9841 1.0013 0.8927 4.1737 0.9423 1.0180 0.9076 2.2636 3.5720 3.1251 3.4449 0.9465 3.4414 0.9361 3.3433 0.9374 0.9324 0.9319 3.2253 3.2171 3.9480 3.9977 0.9602 1.0390 1.0635 0.9848 1.0079 1.0231 0.9477
dispersion: -0.078965739 hartree
energy: -774.887415490774 hartree
dipole: 4.084256372 -3.194051236 0.890205136 -6.248642241 3.672466757 -2.576175484 -2.669311021 2.523937241 -0.145373780
dipolemethod: SCF
magnitude: 2.729519893 au
magnitude: 6.937888204 debye
