program: Orca
programVersion: 6.1.x
elementType: C C C C C C H H H H C H H H C C C C H C H C H H H C C C H
charge: 1
multiplicity: 1
keywords: wb97x-d3bj def2-tzvppd def2/J tightscf defgrid3
formula: C16H13
InChI: InChI=1/C16H13/c1-2-14-8-10-16(11-9-14)13-12-15-6-4-3-5-7-15/h1,3-12H,13H2
29 atoms
C  -0.287554 -3.170267 0.190654
C  0.807238 -3.038487 -0.67024
C  1.5710 -1.885948 -0.652211
C  1.263928 -0.856842 0.239028
C  0.155876 -0.973698 1.077534
C  -0.605687 -2.127766 1.066891
H  1.053828 -3.849074 -1.344662
H  2.42736 -1.79761 -1.312953
H  -0.104903 -0.167144 1.7548
H  -1.453381 -2.232833 1.732456
C  2.112014 0.423799 0.261835
H  2.181308 0.848232 1.259435
H  3.10582 0.222787 -0.136851
H  1.375128 0.883839 -1.719446
C  0.34421 2.177695 -0.394085
C  -0.454127 2.661322 -1.462158
C  0.178091 2.72719 0.903825
C  -1.385703 3.650515 -1.24124
H  -0.322664 2.239303 -2.452742
C  -0.75277 3.714825 1.113871
H  0.790174 2.378479 1.725874
C  -1.532004 4.171186 0.044087
H  -1.998128 4.02214 -2.053155
H  -0.883562 4.144899 2.0991
H  -2.264377 4.951994 0.219894
C  1.289219 1.187822 -0.678075
C  -1.080325 -4.365276 0.171761
C  -1.741101 -5.364698 0.155373
H  -2.328044 -6.255752 0.141942
totalener: -617.63252252116752 hartree
nucrepener: 921.01311489912018 hartree
electener: -1538.64564191685463 hartree
oneelecener: -2642.68319909952970 hartree
twoeener: 1104.03755718267507 hartree
kineticenergy: 614.85860489979802 hartree
exchangeener: -58.656953907915 hartree
correlationener: -4.443338922474 hartree
xcener: -63.100292830389 hartree
energy: -286.3783 -284.7031 -284.6895 -284.6591 -284.6333 -284.3999 -284.1300 -284.0754 -284.0336 -283.8360 -283.4507 -283.4129 -283.1916 -283.1764 -282.3446 -282.2367 -32.2577 -31.3654 -30.4056 -29.0203 -28.7585 -27.7712 -27.7240 -26.4038 -25.6421 -24.6238 -23.8014 -23.6577 -23.2215 -22.0201 -21.5625 -20.9069 -20.3241 -20.1047 -19.8262 -19.4830 -19.1740 -19.0528 -18.7518 -18.4172 -18.1586 -17.9391 -17.6401 -17.1764 -16.9710 -16.6324 -16.3332 -15.8803 -14.9519 -14.2444 -14.1843 -13.2729 -13.1911 -12.0589 -5.8525 -2.5648 -2.4236 -1.7739 -1.6457 -1.4650 -1.2654 -1.0649 -0.6913 -0.5236 -0.4240 electronvolt
chargesum: 1.0000000
charge: 0.247013 -0.319575 -0.072935 0.431114 0.328010 -0.511546 -0.031959 -0.061622 -0.057956 -0.049086 0.573009 0.094056 0.092862 -0.028405 0.537860 -0.115810 0.066333 -0.126494 -0.058135 -0.325032 -0.065152 0.125242 0.021969 0.013238 0.047722 0.158536 -0.184013 0.206105 0.064651
charge: -0.186158 0.083392 0.070254 -0.160851 0.071248 0.083166 0.027301 0.025930 0.020647 0.026512 0.057007 0.024552 0.042796 0.052445 -0.149466 0.112702 0.103976 0.068940 0.031851 0.069933 0.019360 0.102830 0.022278 0.022373 0.028433 0.202454 -0.057499 0.249268 -0.065678
qa: 0.2470 -0.3196 -0.0729 0.4311 0.3280 -0.5115 -0.0320 -0.0616 -0.0580 -0.0491 0.5730 0.0941 0.0929 -0.0284 0.5379 -0.1158 0.0663 -0.1265 -0.0581 -0.3250 -0.0652 0.1252 0.0220 0.0132 0.0477 0.1585 -0.1840 0.2061 0.0647
va: 1.2952 3.1996 3.2621 2.6039 3.0585 2.9239 0.9897 0.9532 0.8302 1.0047 2.8651 0.9382 0.9973 0.9345 1.5631 3.2179 3.2556 3.3719 0.9770 3.4827 0.9120 3.3242 0.9459 0.9534 0.9198 3.3333 3.2684 3.8125 1.0242
dispersion: -0.069010091 hartree
energy: -617.701532612091 hartree
dipole: 1.470416647 -1.174589860 0.295826787 5.495907796 -3.035316120 2.460591676 -0.166323207 -0.228214800 -0.394538007
dipolemethod: SCF
magnitude: 2.509518903 au
magnitude: 6.378690128 debye
